program: Gaussian 09
title: 000174768
version: EM64L-G09RevD.01
frameworkgroup: C1[X(C5H11NO2S)]
method: RPBEPBE
basis: SDD
operation: Freq
keyword: #p
keyword: freq=noraman
keyword: PBEPBE/SDD
title: #p freq=noraman PBEPBE/SDD
converged: YES YES NO NO
title: Mulliken charges:
elementType: S O O N C C C C C H H H H H H H H H H H
charge: 0.161402 -0.415452 -0.237659 -0.616440 -0.400707 -0.094481 -0.692040 0.166729 -0.837985 0.222808 0.224597 0.261203 0.254130 0.292568 0.302421 0.270428 0.254168 0.256536 0.248543 0.379231
chargesum: 0.00000
title: Mulliken charges with hydrogens summed into heavy atoms:
elementType: S O O N C C C C C
charge: 0.161402 -0.036221 -0.237659 -0.043591 0.046698 0.166721 -0.145342 0.166729 -0.078737
polarizability: 1.04623043e+02 -4.82087301e+00 8.04246122e+01 6.60871000e+00 1.99729584e+00 6.58009548e+01
1716.lowfreq: -14.0074 -6.9637 -0.0020 -0.0019 0.0013 13.9251 35.1145 41.1411 62.3912
frequency: 34.6691 40.0895 61.9704 101.2365 134.7478 147.5460 211.8452 250.6115 291.9646 304.8554 316.2300 402.8767 466.3208 500.6578 589.6848 598.5701 616.0019 666.5071 701.8100 748.2711 832.4112 939.8558 955.4446 963.6830 1015.1102 1048.0848 1052.6271 1113.0741 1151.4969 1168.5822 1203.8500 1257.5892 1289.8182 1313.5980 1321.0026 1342.9193 1399.6135 1434.8132 1446.1009 1456.5444 1461.3785 1604.0755 1669.1442 2971.0589 2999.6569 3011.8278 3018.9574 3034.2475 3099.2434 3111.0075 3127.3794 3493.6956 3503.0739 3636.2834
redmass: 7.0761 4.1450 3.7581 2.2373 1.4343 3.5212 1.3317 2.5606 3.5283 2.4260 2.1143 3.4634 1.4298 4.4286 3.5550 1.5499 2.7739 6.5115 3.2532 2.4797 2.0000 1.5688 1.6759 1.3253 1.7718 3.1621 2.8854 1.4565 1.3215 1.5142 1.4215 1.5783 1.3067 1.1346 1.3501 1.1455 1.7169 1.0875 1.0746 1.0781 1.0523 1.2763 4.0161 1.0607 1.0292 1.0842 1.0645 1.0976 1.1038 1.1054 1.1020 1.0447 1.0638 1.1000
irintensity: 2.7541 0.5020 1.1991 2.2975 1.3116 0.3034 46.9768 5.8770 3.2384 13.9850 0.4106 17.3573 246.3808 42.2878 2.7651 98.0732 29.5431 6.4880 75.3473 13.9243 6.7364 7.1000 14.8989 13.3965 1.4996 33.2790 235.8745 7.7285 0.8810 13.7155 13.3252 7.2374 6.9582 2.8683 15.5624 2.9775 7.5793 8.5230 16.5403 20.4529 14.2870 158.9852 166.9037 20.1683 37.9338 17.8589 19.2624 35.1242 5.1372 26.1153 11.2664 10.1060 21.6603 10.9630
temp: 298.150 k
press: 1.00000 atm
elementType: 16 8 8 7 6 6 6 6 6 1 1 1 1 1 1 1 1 1 1 1
symmnumber: 1
zpe: 422483.4 jmol-1
zpe.correction: 0.160915 hartree
zpe.thermalcorrener: 0.172665 hartree
zpe.thermalcorrenthalpy: 0.173609 hartree
zpe.thermalcorrgfe: 0.121829 hartree
zpe.sumelectzpe: -799.646742 hartree
zpe.sumelectthermal: -799.634993 hartree
zpe.sumelectthermalent: -799.634048 hartree
zpe.sumelectthermalfe: -799.685829 hartree
dipole: -1.7577 0.7549 2.1372
dipole: 2.8683
quadrupole: -67.6727 -55.2878 -64.4644
quadrupole: -9.4641 -1.6353 0.0721
quadrupole: -5.1977 7.1871 -1.9894 -9.4641 -1.6353 0.0721
hfenergy: -799.8076578 hartree
pointgroup: C01 [X(C5H11N1O2S1)]
dipole: -0.7538373 0.347955 0.764274 debye
dipolederiv: -0.2685036 -0.0532933 -0.0108316 -0.0627495 -0.1192147 0.0860371 -0.0627983 0.051048 -0.1052106 -0.3540527 -0.141364 0.026017 -0.2117403 -1.116556 -0.2052323 0.0624095 -0.1498129 -0.3795423 -0.9605471 -0.1958067 -0.1940613 0.0306898 -0.6222279 -0.0106111 -0.2954545 -0.1120385 -0.3964188 -0.5414246 -0.1129296 0.2643976 -0.2414885 -0.5332059 0.0513445 0.3684775 0.1288526 -0.6944695 0.0057391 -0.1211395 0.061022 0.0334485 -0.0501604 0.0123829 -0.1145789 0.0792035 -0.0190545 0.0127506 0.286985 -0.1644563 0.3205489 0.3700461 -0.1011186 -0.1812196 -0.0550242 0.3014761 0.2171301 0.0492432 0.1627609 0.0815789 0.0284031 -0.0242568 0.2162874 0.0353699 0.1688121 1.24016 0.1625506 0.3317802 -0.0175581 1.3572026 0.1936206 0.4557652 0.195185 0.3190163 0.0922643 -0.0657151 -0.0790721 -0.0531189 0.0792963 -0.0128546 -0.0521126 -0.0385987 -0.0066178 -0.0404422 -0.0497958 -0.1316587 -0.0672912 0.0662553 -0.0390409 -0.0578795 -0.0259461 -0.1010829 -0.0222695 0.1151998 0.0114676 0.0827504 -0.0969914 0.0280671 0.0475691 0.0491429 0.0733963 0.1021291 -0.0571332 -0.0539771 -0.0125687 -0.007942 -0.0433335 -0.037259 -0.0377368 -0.0288584 -0.092868 -0.0453997 0.0801449 -0.0400604 0.0772738 -0.0238685 0.0364885 0.0136596 -0.1308278 0.0656512 0.0744589 -0.0543336 0.0279923 -0.0202425 0.0108118 -0.0930005 -0.0009275 0.0724344 0.2624346 -0.0427891 -0.0809558 -0.027531 0.2079121 0.0211116 -0.1668832 -0.0584539 0.2026373 0.1220531 0.1043585 -0.0744589 0.0664755 0.0989958 0.0239402 -0.0781155 -0.0858053 0.3654362 0.0111416 0.0368067 0.0795515 0.0514585 0.0372183 0.0257374 0.1620113 0.007401 -0.0881777 -0.0299374 0.0335529 -0.1043647 0.0329662 0.1031024 0.0021692 -0.1151185 0.0014176 0.0170841 0.0287533 -0.066639 0.021658 -0.022591 -0.1603681 -0.0173897 0.0400426 -0.0516456 0.0951482 0.149838 0.0888495 -0.0906296 0.0287888 0.301203 0.0224833 -0.1346308 0.0547092 0.3348192 unknown
polarizability: 103.3054415|-4.4772785|80.6137104|9.8578615|0.7386894|66.9294582 unknown
InChI: InChI=1S/C5H11NO2S/c1-9-3-2-4(6)5(7)8/h4,7H,2-3,6H2,1H3
charge 0 multiplicity 1
20 atoms
S  -2.466695 -0.654485 -0.720123
O  1.45336 -1.70196 -0.206135
O  2.913472 -0.075498 0.570458
N  1.378337 1.8966 -0.621443
C  -0.373465 0.656258 0.765428
C  0.727465 0.610862 -0.361264
C  -1.327636 -0.551658 0.793861
C  1.819807 -0.373389 0.040825
C  -3.682157 0.713504 -0.276634
H  0.122006 0.767403 1.752227
H  -0.952892 1.585509 0.600304
H  0.236461 0.234595 -1.278457
H  -1.976042 -0.52667 1.6876
H  -0.773843 -1.50469 0.785725
H  2.168762 2.111959 -0.009276
H  0.752583 2.677582 -0.819885
H  -4.160307 0.496834 0.692554
H  -4.446665 0.71802 -1.069285
H  -3.183751 1.695577 -0.246562
H  2.188199 -2.304552 0.093484
