program: Gaussian 09
title: 000175066
version: EM64L-G09RevD.01
frameworkgroup: C1[X(C22H15Cl3N4O5S)]
method: RPBEPBE
basis: SDD
operation: Freq
keyword: #p
keyword: freq=noraman
keyword: PBEPBE/SDD
title: #p freq=noraman PBEPBE/SDD
converged: YES YES NO NO
title: Mulliken charges:
elementType: Cl Cl Cl S O O O O O N N N N C C C C C C C C C C C C C C C C C C C C C C H H H H H H H H H H H H H H H
charge: 0.017741 -0.033796 -0.027681 0.996165 -0.161506 -0.546666 -0.278925 -0.491767 -0.531908 -0.335674 -0.014450 -0.025795 -0.058863 -0.440605 0.240161 0.182245 0.669640 -0.273916 -0.763349 -0.044512 -0.354863 -0.275160 -0.177029 0.063602 0.270811 -0.304776 -0.312638 -0.105168 -0.204337 0.540643 -0.365791 -0.337403 -0.214228 -0.223311 -0.256938 0.297426 0.308957 0.250941 0.239793 0.257361 0.299740 0.271930 0.281949 0.274698 0.265904 0.388958 0.254320 0.318487 0.230649 0.238937
chargesum: 0.00000
title: Mulliken charges with hydrogens summed into heavy atoms:
elementType: Cl Cl Cl S O O O O O N N N N C C C C C C C C C C C C C C C C C C C C C C
charge: 0.017741 -0.033796 -0.027681 0.996165 -0.161506 -0.157708 -0.278925 -0.491767 -0.531908 -0.335674 -0.014450 -0.025795 -0.058863 -0.143178 0.240161 0.182245 0.669640 0.035040 -0.015254 -0.044512 -0.354863 0.024580 0.094901 0.063602 0.270811 -0.022827 -0.037939 -0.105168 0.061567 0.540643 -0.365791 -0.083084 0.104260 0.007338 -0.018001
polarizability: 5.23334889e+02 -1.46224399e+01 3.30548369e+02 9.38183710e+00 6.15566770e+00 2.36456401e+02
1716.lowfreq: -4.1918 -1.6308 -0.0025 -0.0012 -0.0008 3.0416 16.2191 19.4683 19.7456
frequency: 16.1572 19.4222 19.7313 30.6552 34.9606 42.2438 47.7628 55.0068 59.1045 71.0393 74.9112 80.7632 91.8107 104.4120 113.8831 120.9874 125.4349 135.9892 144.9189 162.0790 165.7960 197.4073 204.1675 218.4978 231.0913 243.2606 251.6905 259.0390 265.3546 268.1624 292.3875 299.1166 319.8153 325.0184 340.1207 348.4210 355.7640 362.8318 377.2395 390.3688 400.5426 436.7628 441.2417 446.0786 457.9496 468.1343 494.7957 516.5300 529.6107 541.8346 546.9558 557.3864 580.7627 586.8906 592.0462 602.3465 638.2822 644.4320 656.5074 672.5224 702.6240 704.3190 714.3179 725.2351 730.7050 745.4920 759.2784 801.3950 826.7126 828.7954 831.8715 838.1723 854.5282 875.9915 891.0958 894.6114 909.7452 945.2396 948.0734 952.0413 958.8376 967.3896 973.6843 980.5592 995.9068 1018.0397 1033.5777 1036.9999 1037.7306 1041.8356 1067.6380 1073.0344 1080.2090 1103.8178 1124.8306 1126.0298 1143.8300 1170.5406 1172.1007 1183.8408 1190.6645 1232.9806 1247.3093 1248.7074 1258.0912 1268.7025 1285.1870 1338.3153 1357.8646 1368.3690 1378.5094 1383.7479 1397.7218 1399.2434 1409.6691 1425.9542 1451.1722 1452.1553 1454.9807 1465.1225 1470.4406 1555.2063 1557.4417 1579.5894 1579.9604 1589.8540 1599.2445 1602.7738 1669.2154 2982.0248 2999.8257 3057.9487 3114.6910 3137.5260 3146.0562 3157.2954 3157.7084 3160.3832 3164.6090 3173.0504 3176.8428 3182.0230 3182.4081 3476.9410
redmass: 8.0184 8.1943 5.8311 7.7948 9.3616 11.2587 8.9587 6.4870 9.1615 10.1738 6.8861 5.5898 7.5768 2.3458 9.1187 2.8636 6.4215 1.5345 4.3687 3.0192 10.8392 9.0103 9.1914 6.7365 5.8150 4.7317 7.7282 6.2069 8.2142 6.4785 6.8645 6.2192 6.9712 8.2018 7.7645 8.7454 8.5121 6.5795 8.6193 7.9718 8.9174 5.1988 3.5826 5.9569 3.4669 3.9694 6.4346 7.3722 4.0782 6.7012 8.1573 7.8342 5.6390 6.4131 5.2309 6.4007 6.9719 6.9285 6.4811 7.7014 4.2780 5.1910 7.4172 4.9333 6.6642 4.0131 1.2472 7.4458 2.0421 1.4893 2.7257 8.0088 1.3601 5.4132 1.6474 1.4878 3.5120 1.5300 3.1144 1.4408 5.8299 1.3757 3.3918 1.3144 3.0689 7.3354 6.7600 2.5878 3.3502 1.7696 1.5191 1.9369 1.6974 2.3224 2.8236 1.5559 1.5394 1.7638 1.1107 3.2815 1.4536 2.6496 1.5439 1.6706 1.3861 1.4389 2.9866 3.3248 7.3856 6.5981 8.2466 4.8484 3.2944 2.2274 2.8966 2.2354 2.2117 1.2532 1.0557 2.4990 3.4486 7.8312 6.5775 6.3750 6.2812 7.3412 8.2419 7.4844 12.8575 1.0380 1.0823 1.0969 1.0985 1.0858 1.0911 1.0943 1.0942 1.0894 1.0895 1.1006 1.0927 1.0972 1.0973 1.0662
irintensity: 1.2159 2.1188 1.1152 2.0770 1.9733 2.3233 0.2467 2.0074 0.4914 0.2561 2.4830 0.5390 2.7460 86.4801 24.1721 2.5842 0.3708 0.7155 1.5975 34.8740 0.5638 1.5917 1.4989 0.0479 5.0781 14.0621 11.7604 10.8423 2.1204 16.8571 7.9513 11.2704 5.8547 1.9831 2.6735 4.6057 2.5269 0.4310 20.9984 3.1877 69.6370 9.1340 4.6772 7.2794 6.9069 5.9065 4.2586 7.1677 0.5519 15.5607 78.4557 35.5317 21.5381 23.9348 8.9924 13.5409 10.1935 19.8539 10.5517 9.1585 0.5374 2.6127 38.6785 8.1406 22.7416 12.9428 105.0949 7.9003 69.3248 15.6656 38.7868 87.9152 1.1457 1.3650 2.9710 21.7393 29.4549 22.0534 6.5602 3.1036 114.7848 1.3690 40.1678 1.9591 5.3612 41.6627 56.2911 23.4490 42.6334 8.3328 54.1560 19.7296 29.8548 55.9289 48.4991 4.9242 46.7103 45.5030 11.9023 25.8723 5.6600 121.5069 59.3084 61.4495 10.7749 3.6394 158.6370 3.2349 7.2891 32.9384 0.7367 21.2300 30.0828 11.4252 36.7065 26.6189 148.9183 69.1576 20.4054 75.3320 164.2834 10.7759 12.5689 2.4108 29.7170 2.9164 28.0376 34.9295 143.3477 11.3898 10.5869 9.0718 7.4151 5.7301 13.1419 10.8185 18.3161 0.6571 7.4019 17.4231 0.3043 0.9604 2.6963 53.9091
temp: 298.150 k
press: 1.00000 atm
elementType: 17 17 17 16 8 8 8 8 8 7 7 7 7 6 6 6 6 6 6 6 6 6 6 6 6 6 6 6 6 6 6 6 6 6 6 1 1 1 1 1 1 1 1 1 1 1 1 1 1 1
symmnumber: 1
zpe: 863324.8 jmol-1
zpe.correction: 0.328823 hartree
zpe.thermalcorrener: 0.362538 hartree
zpe.thermalcorrenthalpy: 0.363482 hartree
zpe.thermalcorrgfe: 0.259404 hartree
zpe.sumelectzpe: -3217.964107 hartree
zpe.sumelectthermal: -3217.930392 hartree
zpe.sumelectthermalent: -3217.929448 hartree
zpe.sumelectthermalfe: -3218.033526 hartree
dipole: -3.5428 3.0073 3.7038
dipole: 5.9425
quadrupole: -228.6617 -218.9155 -232.4234
quadrupole: 17.8423 -5.9907 3.5248
quadrupole: -1.9948 7.7514 -5.7565 17.8423 -5.9907 3.5248
hfenergy: -3218.29293 hartree
pointgroup: C01 [X(C22H15Cl3N4O5S1)]
dipole: 1.2552175 1.3258886 -1.4603162 debye
polarizability: 518.8222034|33.0091142|335.3296967|7.105984|-4.7633402|236.187759 unknown
InChI: InChI=1S/C22H15Cl3N4O5S/c1-12-21(22(30)29(28-12)18-11-14(35(31,32)33)7-8-15(18)24)27-26-17-10-13(23)6-9-20(17)34-19-5-3-2-4-16(19)25/h2-11,21,31H,1H3
charge 0 multiplicity 1
50 atoms
Cl -4.193414 3.807974 0.109506
Cl 7.83988 1.351062 0.725948
Cl -0.128444 -2.542474 1.32813
S  -4.531104 -2.60725 0.532816
O  -0.777611 1.035265 2.280977
O  -4.005846 -2.793622 2.294247
O  2.388518 -1.212191 0.543266
O  -6.078289 -3.033632 0.365809
O  -3.388583 -3.309243 -0.379603
N  -1.765561 1.8527 0.270842
N  -1.387684 2.658339 -0.861929
N  1.573671 1.453191 0.263945
N  2.681189 1.760789 0.869435
C  0.487534 2.426628 0.583958
C  -0.12015 2.989058 -0.698569
C  -0.718598 1.662495 1.204071
C  -3.051485 1.252007 0.307574
C  -3.141393 -0.154255 0.452729
C  0.62914 3.798408 -1.708274
C  -4.412516 -0.738332 0.447772
C  -4.250991 2.005543 0.198921
C  -5.610915 -0.019514 0.317502
C  -5.515227 1.381943 0.189636
C  3.759551 0.838387 0.658638
C  3.6369 -0.568204 0.431835
C  5.055193 1.407637 0.777365
C  4.794557 -1.364832 0.30598
C  6.188535 0.599343 0.607936
C  6.080605 -0.787303 0.371544
C  1.657703 -1.587595 -0.599807
C  0.426018 -2.248216 -0.379821
C  2.088801 -1.345256 -1.923404
C  -0.379644 -2.664175 -1.454871
C  1.288058 -1.767513 -3.007832
C  0.057805 -2.423161 -2.779007
H  0.846844 3.211747 1.279077
H  -2.229921 -0.752531 0.550837
H  1.489287 3.22331 -2.099839
H  1.034208 4.723766 -1.257241
H  -0.030269 4.070235 -2.547478
H  -6.57709 -0.53271 0.313946
H  -6.417932 1.99168 0.099386
H  5.136044 2.476485 0.993693
H  4.677329 -2.444021 0.168323
H  6.975881 -1.405492 0.263529
H  -3.511723 -3.662984 2.358315
H  3.037231 -0.82773 -2.098522
H  -1.338223 -3.154241 -1.254168
H  1.627296 -1.576504 -4.031493
H  -0.565965 -2.745409 -3.618428
