program: Gaussian 09
title: 000175048
version: EM64L-G09RevD.01
frameworkgroup: C1[X(C18H14Cl3N5O8S2)]
method: RPBEPBE
basis: SDD
operation: Freq
keyword: #p
keyword: freq=noraman
keyword: PBEPBE/SDD
title: #p freq=noraman PBEPBE/SDD
converged: YES YES NO NO
title: Mulliken charges:
elementType: Cl Cl Cl S S O O O O O O O O N N N N N C C C C C C C C C C C C C C C C C C H H H H H H H H H H H H H H
charge: 0.020759 0.037615 -0.056352 1.004270 1.022037 -0.161368 -0.550119 -0.547592 -0.493958 -0.484173 -0.530714 -0.507478 -0.231900 -0.319481 -0.008419 -0.030603 -0.051635 -0.446258 -0.438623 0.231057 0.199659 0.690700 -0.773056 -0.369940 -0.253078 -0.019466 -0.158099 -0.220645 0.331469 -0.254639 -0.569355 0.547563 -0.187714 -0.352489 0.263954 -0.670061 0.304835 0.279258 0.254907 0.230317 0.332063 0.322043 0.270316 0.306580 0.323979 0.333725 0.387270 0.381116 0.306300 0.305422
chargesum: 0.00000
title: Mulliken charges with hydrogens summed into heavy atoms:
elementType: Cl Cl Cl S S O O O O O O O O N N N N N C C C C C C C C C C C C C C C C C C
charge: 0.020759 0.037615 -0.056352 1.004270 1.022037 -0.161368 -0.162849 -0.166476 -0.493958 -0.484173 -0.530714 -0.507478 -0.231900 -0.319481 -0.008419 -0.030603 -0.051635 -0.112533 -0.133788 0.231057 0.199659 0.690700 -0.008573 -0.369940 0.078986 -0.019466 -0.158099 0.101398 0.331469 -0.254639 -0.299039 0.547563 0.118866 -0.028510 0.263954 -0.058339
polarizability: 5.85167672e+02 1.79277461e+01 3.48461881e+02 1.57867284e+01 -2.33042128e+01 2.54065003e+02
1716.lowfreq: -5.8855 -1.0588 0.0006 0.0014 0.0017 0.3230 9.9291 13.2246 16.3771
frequency: 9.8791 13.2185 16.3427 28.1645 33.4364 43.6456 46.2950 49.1918 56.8321 65.9596 71.4956 80.9039 89.1755 91.9650 95.8741 110.4365 122.5025 124.7413 135.2867 140.0239 143.4607 171.9133 175.0733 179.8382 184.4300 188.3484 202.5016 212.7420 229.5573 232.7453 249.3775 252.3078 259.7605 279.8069 283.0066 292.2423 310.9053 312.8986 321.4626 323.3314 332.4363 347.4388 351.2306 362.4928 373.6697 386.2926 389.9590 410.1957 420.9422 447.1928 461.1236 464.8916 468.8424 492.9965 517.9377 540.0721 541.4543 556.8365 560.1088 571.4362 590.3009 609.8942 622.9956 637.6721 650.0082 656.1798 676.5508 691.3074 715.1634 729.4498 738.2284 744.5859 754.0706 793.4114 819.7285 821.4537 841.5258 875.2251 885.5582 891.5831 904.0926 907.4547 917.5725 921.4547 929.9596 935.4981 958.7914 972.8564 982.1169 988.6625 1005.6289 1020.6616 1038.3181 1045.9125 1054.7507 1068.7544 1102.7391 1107.0872 1130.5324 1132.2604 1154.5485 1166.5612 1171.7171 1216.2415 1233.0014 1246.0684 1248.0411 1261.6673 1290.7605 1295.3934 1327.0459 1367.5213 1372.7657 1380.5825 1399.3890 1402.2698 1416.2051 1419.4860 1450.0866 1453.3386 1459.6366 1462.8345 1523.9854 1560.8429 1576.3749 1580.7453 1586.1510 1599.5207 1617.8355 1672.2392 2979.5840 3001.3215 3060.0871 3071.2679 3114.2279 3146.9372 3152.8151 3155.3243 3157.4136 3165.1040 3196.8342 3423.1633 3445.4826 3480.4396
redmass: 13.2653 12.3491 12.4456 11.7843 10.9390 7.7035 7.9595 6.5979 10.4756 13.2814 3.6400 8.8263 7.0476 10.4181 5.1075 9.0635 7.0094 5.8990 2.4639 5.3647 10.8422 12.1104 11.6119 5.2443 4.6956 1.3122 7.9412 4.5001 4.2400 7.1536 5.4022 4.3520 7.5118 2.7165 6.6533 5.1371 6.1568 12.2483 6.6721 7.4058 3.6137 9.9000 4.8856 8.6724 5.8889 7.8808 11.4147 9.4645 10.8386 8.9815 3.6013 4.0635 4.9631 5.8637 6.7262 8.1213 11.2689 9.6131 3.3900 9.2675 5.9600 5.9106 8.4306 5.1968 6.4412 7.2603 6.2773 6.6378 4.2596 4.8490 2.6030 7.2038 1.3617 7.0076 13.3940 8.2385 12.2328 1.3463 1.7951 3.8398 1.4879 1.7374 3.6843 1.9614 5.8538 3.5912 7.6954 4.1960 3.9162 3.1213 1.3317 3.7075 5.1713 3.5928 2.4937 1.2745 1.9540 1.2225 1.8738 3.9297 1.1133 1.5465 1.5804 3.2499 1.5200 1.5752 1.2220 1.1973 3.8745 2.2147 4.8403 4.9418 4.6528 4.3075 1.7966 5.5844 6.3483 1.0965 1.1138 2.9867 1.5542 1.7635 2.6633 10.2621 6.8201 4.5515 6.5617 5.4258 6.0032 12.9009 1.0377 1.0822 1.0972 1.0567 1.0987 1.0924 1.1091 1.0911 1.0922 1.0942 1.0950 1.0653 1.0768 1.0662
irintensity: 0.0738 0.7033 0.3761 0.5097 0.7342 1.6279 2.4560 1.5782 0.0299 0.4120 7.2022 1.8294 7.1707 0.5910 4.1961 0.6349 4.9697 12.0270 72.5940 4.5495 1.8363 1.8932 3.3208 0.6219 8.6630 2.2753 3.1033 9.3756 5.7826 4.3360 24.0791 19.3258 17.3930 33.5308 18.7323 3.6712 9.8139 3.9277 12.9419 14.8778 16.0732 15.6678 19.6866 14.9062 5.9489 74.3225 10.8684 6.4710 9.4507 41.4374 4.2156 6.2014 38.9844 28.1164 12.6323 46.6518 54.7030 182.1733 15.7425 45.3774 9.5140 4.0251 3.5039 32.4210 0.4385 11.3651 9.5037 75.3281 6.6520 5.7785 2.6463 85.7840 35.3187 4.9017 46.2882 32.1303 107.8690 34.7162 2.0992 2.4298 17.8174 6.3205 137.1803 33.4323 54.4151 63.4136 54.3478 14.8893 75.0511 20.8676 0.7526 23.9368 32.1140 38.7297 77.8661 82.2045 55.8097 57.7019 8.6709 104.0512 0.3837 14.3953 7.8110 10.9438 29.4850 12.0883 13.4380 14.5850 124.6896 124.8069 71.2369 58.4532 129.7849 75.7427 49.7771 40.3758 9.1525 24.4255 12.6606 28.4915 52.8425 149.0728 829.7754 18.6588 76.5126 110.2431 78.7528 174.8063 100.0190 153.8514 10.4230 7.7596 8.7135 1.7661 7.2702 2.9027 0.0954 11.5605 32.8826 14.4431 16.6418 44.4800 134.6184 63.3990
temp: 298.150 k
press: 1.00000 atm
elementType: 17 17 17 16 16 8 8 8 8 8 8 8 8 7 7 7 7 7 6 6 6 6 6 6 6 6 6 6 6 6 6 6 6 6 6 6 1 1 1 1 1 1 1 1 1 1 1 1 1 1
symmnumber: 1
zpe: 816819.1 jmol-1
zpe.correction: 0.311110 hartree
zpe.thermalcorrener: 0.348430 hartree
zpe.thermalcorrenthalpy: 0.349374 hartree
zpe.thermalcorrgfe: 0.236449 hartree
zpe.sumelectzpe: -3743.126169 hartree
zpe.sumelectthermal: -3743.088849 hartree
zpe.sumelectthermalent: -3743.087904 hartree
zpe.sumelectthermalfe: -3743.200829 hartree
dipole: -10.8996 4.0085 -0.6077
dipole: 11.6292
quadrupole: -244.1623 -235.5696 -247.7657
quadrupole: -2.4619 1.8336 12.7807
quadrupole: -1.6631 6.9296 -5.2665 -2.4619 1.8336 12.7807
hfenergy: -3743.4372787 hartree
pointgroup: C01 [X(C18H14Cl3N5O8S2)]
dipole: -4.2266941 -1.7505767 0.0621544 debye
polarizability: 586.6967758|-7.6162938|349.5697297|-8.1355899|-19.3232509|251.42805 unknown
InChI: InChI=1S/C18H14Cl3N5O8S2/c1-8-17(18(28)26(25-8)13-5-11(21)15(6-10(13)20)36(32,33)34)24-23-12-4-9(22-16(27)7-19)2-3-14(12)35(29,30)31/h2-6,17,22,29,32H,7H2,1H3
charge 0 multiplicity 1
50 atoms
Cl 4.848302 -3.237806 0.680556
Cl 4.068672 3.143285 0.551037
Cl -8.88798 -0.697891 2.475355
S  7.187884 1.754655 0.789719
S  -1.11011 0.569248 -1.906206
O  0.759006 -0.746094 2.005848
O  6.857931 2.447512 2.472402
O  -0.94944 -0.911222 -3.024927
O  8.391274 0.681402 0.881823
O  7.285961 2.977524 -0.261013
O  -1.301721 1.80139 -2.948131
O  0.132707 0.678108 -0.877353
O  -7.890946 1.822398 -0.562646
N  2.163474 -1.674827 0.314498
N  2.065199 -2.644821 -0.749988
N  -1.134294 -1.681526 -0.253868
N  -2.169775 -1.544858 0.511837
N  -6.673875 0.196271 0.637015
C  -0.043202 -2.47536 0.334381
C  0.825884 -3.09754 -0.751024
C  0.966028 -1.491437 1.028115
C  3.332717 -0.88114 0.439817
C  0.328453 -4.054522 -1.78501
C  4.624853 -1.450933 0.57326
C  3.186026 0.528253 0.430072
C  5.585359 0.765394 0.660274
C  4.312978 1.358594 0.556046
C  5.758932 -0.628353 0.673048
C  -3.101725 -0.606821 -0.059837
C  -2.81814 0.322283 -1.096684
C  -4.393794 -0.606112 0.503006
C  -5.399749 0.270622 0.022506
C  -3.800377 1.199703 -1.57961
C  -5.098983 1.178113 -1.02939
C  -7.805075 0.935354 0.336077
C  -9.063106 0.657464 1.164341
H  -0.413505 -3.188434 1.097543
H  -0.44007 -3.550322 -2.402004
H  1.154007 -4.37883 -2.437925
H  -0.138963 -4.944123 -1.323593
H  2.188708 0.959645 0.299974
H  6.764364 -1.048837 0.778707
H  -4.584738 -1.312097 1.319213
H  -3.545639 1.911585 -2.37162
H  -5.869144 1.858515 -1.396052
H  -6.787202 -0.483323 1.400041
H  7.342886 3.322248 2.527221
H  -0.726345 -0.497621 -3.914173
H  -9.355153 1.570106 1.704097
H  -9.876156 0.33628 0.497323
