program: Gaussian 09
title: 000174701
version: EM64L-G09RevD.01
frameworkgroup: C1[X(C8H15ClO2)]
method: RPBEPBE
basis: SDD
operation: Freq
keyword: #p
keyword: freq=noraman
keyword: PBEPBE/SDD
title: #p freq=noraman PBEPBE/SDD
converged: YES YES NO NO
title: Mulliken charges:
elementType: Cl O O C C C C C C C C H H H H H H H H H H H H H H H
charge: -0.097993 -0.283049 -0.263187 0.056868 -0.374745 -0.501117 -0.704259 -0.349189 -0.689547 0.274721 -0.582404 0.226286 0.194973 0.212405 0.250516 0.262977 0.221986 0.213467 0.248747 0.224055 0.233935 0.208428 0.232710 0.217366 0.263264 0.302784
chargesum: 0.00000
title: Mulliken charges with hydrogens summed into heavy atoms:
elementType: Cl O O C C C C C C C C
charge: -0.097993 -0.283049 -0.263187 0.283154 0.032633 0.012377 -0.020058 0.108800 -0.031043 0.274721 -0.016356
polarizability: 1.17377871e+02 -7.79337322e-01 9.39955634e+01 5.96738844e-01 -3.09491459e+00 9.10287569e+01
1716.lowfreq: -19.1382 -8.3093 -0.0028 -0.0021 0.0006 3.0163 10.6365 30.6413 61.9123
frequency: 6.5082 30.2582 61.8950 66.2688 109.9165 123.6350 170.7435 189.2910 211.1062 223.5788 231.7451 295.1808 330.1097 378.7396 410.6625 449.7619 484.8202 551.0761 586.1154 656.3116 741.7019 790.0854 811.4192 849.1708 868.2466 912.0503 966.5688 980.4123 994.7271 1008.4336 1037.8028 1102.7789 1109.8023 1120.3591 1130.4606 1162.9400 1166.6534 1181.8841 1259.6856 1264.2361 1292.2752 1297.0861 1325.7126 1352.2659 1357.6319 1363.4734 1387.2013 1390.6255 1435.5903 1439.4245 1453.4397 1457.4100 1467.2363 1476.0273 1478.1699 1486.6595 1627.4459 2982.2057 2986.2237 2991.4299 2992.0185 3004.0993 3017.4466 3042.6832 3056.9415 3059.5033 3070.8022 3076.7730 3086.9881 3091.1313 3101.6859 3156.9672
redmass: 4.3708 5.4999 5.4216 4.8263 1.8948 3.4115 2.4692 2.0516 1.0689 3.3644 1.4663 3.0283 2.8651 2.8475 2.5053 2.8330 2.8250 3.0770 4.2555 4.3500 1.9609 1.8594 1.6278 2.2957 2.7296 2.6324 1.2778 1.8348 1.4205 1.7696 3.1492 2.5098 2.2164 1.3116 2.0651 1.5616 1.4955 1.9601 1.2072 1.2270 1.2368 1.2833 1.2185 1.7485 1.6965 1.4643 1.2199 1.2143 1.0891 1.0869 1.0747 1.0966 1.0567 1.0446 1.0446 1.0549 8.9902 1.0371 1.0556 1.0405 1.0620 1.0615 1.0868 1.0989 1.0962 1.0943 1.0639 1.0995 1.0988 1.0999 1.1007 1.1106
irintensity: 0.6707 0.8324 0.6993 2.4144 0.4059 2.6681 7.7798 3.1827 0.3698 6.7861 2.9248 5.4389 8.8446 1.6291 6.0044 0.6820 1.8765 4.3577 15.5338 8.0898 0.4150 21.1952 29.5496 4.2164 23.1950 34.2907 10.0225 7.9034 51.6252 3.0351 7.7206 193.1991 10.2550 65.2676 5.1573 72.7576 113.8194 3.5656 5.1969 0.6121 32.0475 2.5266 15.9825 39.0677 2.6992 9.5340 16.3259 21.3803 40.8858 19.6327 3.0401 15.1696 13.8152 5.4475 17.7027 11.3030 149.3329 35.1023 11.0390 39.5454 11.3871 15.1153 5.5460 13.2707 12.5315 7.7514 23.7965 44.3682 17.2272 65.7925 22.0786 9.4298
temp: 298.150 k
press: 1.00000 atm
elementType: 17 8 8 6 6 6 6 6 6 6 6 1 1 1 1 1 1 1 1 1 1 1 1 1 1 1
symmnumber: 1
zpe: 573201.0 jmol-1
zpe.correction: 0.218321 hartree
zpe.thermalcorrener: 0.232090 hartree
zpe.thermalcorrenthalpy: 0.233034 hartree
zpe.thermalcorrgfe: 0.174551 hartree
zpe.sumelectzpe: -923.474674 hartree
zpe.sumelectthermal: -923.460905 hartree
zpe.sumelectthermalent: -923.459961 hartree
zpe.sumelectthermalfe: -923.518444 hartree
dipole: -2.2555 -1.3151 0.0057
dipole: 2.6109
quadrupole: -73.1460 -71.6679 -78.1843
quadrupole: -7.8446 3.6738 0.7942
quadrupole: 1.1867 2.6649 -3.8516 -7.8446 3.6738 0.7942
hfenergy: -923.692995 hartree
pointgroup: C01 [X(C8H15Cl1O2)]
dipole: 0.8857251 -0.4929153 0.1664342 debye
dipolederiv: -0.3278821 0.1293104 0.0210207 0.199004 -0.4981389 -0.0687451 0.0668535 -0.1332391 -0.2487068 -1.6685647 -0.4647413 0.013258 -0.5115292 -0.51053 0.0318081 -0.0378887 0.0179473 -0.4804298 -0.7668481 -0.1223558 0.0574947 -0.2289735 -0.3843201 -0.0747918 -0.335896 -0.2039192 -0.8061399 0.8288867 0.1444675 -0.0722211 0.1195425 0.3811818 -0.0935615 -0.3302692 -0.1577926 0.3116834 0.0173906 -0.0082147 -0.0359935 -0.0019924 0.0553019 0.0448159 -0.0276826 0.0571622 0.0971469 -0.1375628 -0.0668903 0.0689339 -0.0188855 0.049079 -0.0169039 0.1845982 0.0227399 -0.1836358 -0.1081456 0.0484599 -0.0595958 0.0342214 -0.0933299 0.1081225 0.0349469 0.1093797 0.002727 0.0710853 0.0369086 -0.0344297 0.1022656 -0.0459355 -0.0050612 0.0314341 -0.0307845 0.0324916 0.0274066 0.0373997 -0.0295499 0.0046226 -0.021873 0.0575245 -0.0395764 0.0621685 0.0423483 1.7144017 0.5123567 -0.0846033 0.7017655 0.4140665 0.1096125 0.4018837 0.2878155 0.9772508 0.2783626 -0.1981564 -0.0662323 -0.283476 0.6123458 0.1942009 -0.0988299 0.1673635 0.2116185 0.0106333 -0.0274043 -0.0085926 0.0050225 -0.067521 -0.0802926 0.0826668 -0.0370371 -0.0208313 -0.0875658 -0.0705964 0.0875765 -0.0482626 0.0286105 0.067784 0.1058875 0.0809725 -0.0267799 0.0786177 0.045997 0.017491 0.0248029 -0.0705062 -0.1036614 -0.0415229 -0.1060882 -0.0397121 -0.021357 0.0493779 -0.0627584 0.0246951 0.0488758 0.0963056 -0.0693983 0.0690033 0.0232886 0.0994949 -0.0139441 0.0495306 -0.0573767 -0.0181136 -0.0662448 0.0081322 -0.0405697 0.0895876 0.1111692 0.0016934 -0.0059389 0.0101967 -0.0251576 -0.0638707 -0.0129275 -0.1393119 -0.0357081 -0.045594 -0.0546681 0.1352915 -0.0601844 0.0586033 0.0297272 0.1386458 0.0482591 0.0087015 -0.0674252 0.0453844 -0.1085837 0.017076 0.07308 -0.0050202 -0.102142 0.0130682 0.0510557 0.0587512 0.0945331 0.0064794 0.047499 -0.0720764 -0.0800611 -0.0674924 -0.0715683 0.0452992 -0.0473582 -0.0494955 0.0793556 -0.0453076 0.084955 0.044262 0.0735173 0.0955944 -0.0592759 0.1011438 -0.0010081 -0.0034085 0.0229964 -0.0480758 -0.0898511 0.0272336 -0.1435527 -0.0682617 -0.0017637 -0.0774634 0.1309378 -0.0530517 0.0407406 0.0361785 0.1158375 0.0553072 0.0076749 -0.1378329 0.0373415 -0.1366432 0.0147663 0.0643985 0.013496 -0.1369305 0.0278435 0.0246448 -0.1106605 -0.0273528 -0.0542365 -0.0300386 -0.0301515 -0.0818481 -0.0426483 -0.0638271 0.0599261 0.1312171 -0.0009387 0.0954175 0.0106017 -0.025509 -0.0039244 0.0715678 0.0130655 -0.0159637 unknown
polarizability: 117.3552071|0.4682458|95.7930725|-1.2881979|0.8583353|89.2539114 unknown
InChI: InChI=1S/C8H15ClO2/c1-3-7(2)11-8(10)5-4-6-9/h7H,3-6H2,1-2H3
charge 0 multiplicity 1
26 atoms
Cl -4.097656 1.353444 0.548225
O  0.810261 0.304829 0.40103
O  -0.539964 -0.518072 -1.315694
C  1.912745 0.619192 -0.585716
C  3.221331 0.53306 0.213315
C  -1.369194 -0.464307 1.019727
C  1.639112 2.000991 -1.19383
C  -2.686377 -1.103951 0.54062
C  3.521595 -0.881278 0.750495
C  -0.363752 -0.245322 -0.102273
C  -3.528858 -0.213429 -0.373349
H  1.872361 -0.160524 -1.37043
H  4.040655 0.866856 -0.454076
H  3.173978 1.257497 1.049218
H  -0.888658 -1.093798 1.791845
H  -1.570375 0.510861 1.502588
H  1.621872 2.776462 -0.407591
H  2.433366 2.257772 -1.918648
H  0.673865 2.011547 -1.72734
H  -2.461318 -2.025986 -0.032779
H  -3.286202 -1.400943 1.420226
H  3.595124 -1.61446 -0.074808
H  2.721753 -1.215642 1.433981
H  4.476654 -0.900143 1.305658
H  -4.462702 -0.703527 -0.685065
H  -2.964017 0.147472 -1.243329
