program: Gaussian 09
title: 000174743
version: EM64L-G09RevD.01
frameworkgroup: C1[X(C13H19N5O5)]
method: RPBEPBE
basis: SDD
operation: Freq
keyword: #p
keyword: freq=noraman
keyword: PBEPBE/SDD
title: #p freq=noraman PBEPBE/SDD
converged: YES YES NO NO
title: Mulliken charges:
elementType: O O O O O N N N N N C C C C C C C C C C C C C H H H H H H H H H H H H H H H H H H H
charge: -0.262703 -0.243048 -0.261470 -0.260285 -0.374417 -0.169295 -0.079613 -0.043013 -0.227983 -0.329526 -0.118908 -0.084343 -0.086801 -0.019603 -0.329134 0.164174 -0.212554 -0.091748 -0.511620 -0.515979 0.305313 -0.497791 -0.351386 0.227846 0.200650 0.290105 0.250994 0.204258 0.189805 0.270192 0.237430 0.195106 0.239483 0.220655 0.198438 0.244521 0.196908 0.240492 0.208219 0.247973 0.351893 0.386767
chargesum: 0.00000
title: Mulliken charges with hydrogens summed into heavy atoms:
elementType: O O O O O N N N N N C C C C C C C C C C C C C
charge: -0.262703 -0.243048 -0.261470 -0.260285 0.012350 -0.169295 -0.079613 -0.043013 -0.227983 0.022367 0.108938 0.116307 0.203304 0.231391 0.064928 0.164174 0.057637 -0.091748 0.160399 0.147634 0.305313 0.147828 -0.103413
polarizability: 2.79881445e+02 -5.41657299e+00 1.56814334e+02 -3.70908718e+00 -1.69059325e+01 1.65388285e+02
1716.lowfreq: -15.0246 -4.8193 -0.0010 -0.0008 -0.0003 4.9794 8.7463 19.8115 25.7943
frequency: 3.5994 19.0406 25.4574 42.8850 51.8860 66.8848 78.8453 103.7399 113.9927 118.0212 127.9127 145.4392 159.3495 173.4959 191.3148 205.3406 211.7408 217.2617 225.6621 229.1401 253.3658 286.8086 299.7295 325.7930 353.2909 360.0429 364.3195 378.6824 450.1218 494.8136 518.6363 540.4822 549.1622 580.0247 591.3619 617.3160 650.4736 660.6084 675.7673 700.1805 757.7889 775.9930 808.2269 816.6484 832.4766 857.3427 865.8111 891.6019 929.6587 932.3590 950.6813 959.6878 976.2111 1018.3648 1027.0120 1039.8925 1052.7821 1069.8658 1088.0597 1101.4758 1112.4885 1113.5402 1116.4295 1119.0982 1126.7029 1136.8905 1150.8896 1157.1810 1172.8303 1205.4154 1220.2075 1224.3391 1242.0915 1262.6071 1275.9775 1290.6131 1303.9305 1309.3855 1320.4622 1330.4981 1338.8213 1348.4423 1363.6343 1379.7230 1388.0804 1401.8819 1426.5068 1430.1139 1434.0083 1436.5889 1452.1871 1454.8726 1459.5961 1461.1574 1462.2108 1474.4941 1478.0940 1482.0589 1499.2789 1531.7509 1634.1491 2904.4313 2918.9583 2926.7769 2932.2357 2939.0746 2944.9549 2965.7155 2994.3403 3001.3141 3014.9168 3015.5831 3043.7534 3046.8179 3110.1707 3111.6156 3115.9682 3172.3664 3245.6933 3650.3326
redmass: 4.6076 5.2485 5.0880 4.2793 4.0757 2.5535 7.1396 2.6496 4.9990 3.8352 4.0366 2.9662 1.6468 4.3085 2.8655 2.4910 2.0080 1.6960 2.0786 2.7126 4.2462 3.2548 5.4960 4.4559 5.6413 2.9123 1.5275 3.9164 4.1222 8.5640 4.5390 4.1828 3.7171 2.9247 2.2050 6.5874 4.1075 6.6240 2.4244 5.2170 7.0385 5.3896 2.2236 2.7088 4.3594 4.5757 4.9691 5.0492 1.4428 6.3121 5.2746 5.1886 6.4198 4.0331 3.5229 3.7255 4.4480 4.9343 3.0887 2.4573 1.5670 1.3836 1.7673 2.3116 1.9762 3.5973 1.3746 1.4922 1.7874 1.1449 1.7203 1.4093 1.2649 1.7193 1.4025 1.3781 1.5498 5.2281 1.4829 1.2671 1.7674 2.6522 3.3369 1.4927 2.0654 1.9731 2.8436 1.1721 1.1416 1.1539 1.0530 1.0793 1.0522 3.0086 1.0638 1.0603 1.0543 1.0509 1.7714 7.5054 6.9472 1.0586 1.0809 1.0365 1.0379 1.0548 1.0654 1.0989 1.0857 1.1022 1.1007 1.0857 1.0958 1.0627 1.0971 1.0977 1.1003 1.0925 1.0981 1.0826
irintensity: 0.4079 0.1790 0.3328 1.4343 2.9558 6.8372 10.5240 4.5958 19.5456 1.8355 0.7560 1.7473 0.4911 2.1872 1.9296 1.6572 0.3285 6.2541 3.8011 5.3156 15.4673 6.3891 4.1044 4.9416 6.9367 26.3101 91.7853 24.9106 1.0394 5.5480 1.8605 8.7464 18.3470 60.3028 14.6343 2.9775 26.0251 29.4901 51.8249 12.8469 7.9104 19.6066 19.4318 11.3900 4.7386 27.1577 40.2271 25.9421 13.8178 105.3673 87.5789 25.7692 121.3131 31.1464 1.0837 144.9135 67.4928 100.3644 32.2563 60.1884 5.0424 2.3279 21.1968 27.6107 13.7776 19.8935 10.5979 6.8379 25.4012 1.4907 95.3520 10.6288 1.9579 1.5098 1.9738 59.7739 92.4872 61.2658 4.0285 12.8379 5.1708 5.6014 176.6308 14.2224 2.6270 12.1326 95.6872 9.5259 3.5809 0.7516 5.7297 18.4235 13.1779 13.6833 10.0947 10.7047 12.9622 9.1918 179.4947 65.0139 273.3262 48.7543 29.2265 80.4880 74.6035 27.7649 142.8587 37.3874 53.8258 58.7107 55.1856 8.4461 43.7288 64.2880 26.8814 24.0944 21.4785 12.4411 0.2421 175.2897
temp: 298.150 k
press: 1.00000 atm
elementType: 8 8 8 8 8 7 7 7 7 7 6 6 6 6 6 6 6 6 6 6 6 6 6 1 1 1 1 1 1 1 1 1 1 1 1 1 1 1 1 1 1 1
symmnumber: 1
zpe: 858309.7 jmol-1
zpe.correction: 0.326913 hartree
zpe.thermalcorrener: 0.350337 hartree
zpe.thermalcorrenthalpy: 0.351281 hartree
zpe.thermalcorrgfe: 0.269573 hartree
zpe.sumelectzpe: -1154.774491 hartree
zpe.sumelectthermal: -1154.751068 hartree
zpe.sumelectthermalent: -1154.750124 hartree
zpe.sumelectthermalfe: -1154.831832 hartree
dipole: 7.6124 -0.6691 -3.7023
dipole: 8.4914
quadrupole: -123.4683 -131.2305 -132.8634
quadrupole: 1.3927 -7.6131 0.1221
quadrupole: 5.7191 -2.0431 -3.6760 1.3927 -7.6131 0.1221
hfenergy: -1155.1014044 hartree
pointgroup: C01 [X(C13H19N5O5)]
dipole: 2.9984468 0.114994 -1.468611 debye
polarizability: 280.083469|-0.9687777|163.3794972|-3.6954127|-17.4069837|158.6210981 unknown
InChI: InChI=1S/C13H19N5O5/c1-20-4-7-9(21-2)10(22-3)13(23-7)18-6-16-8-11(17-19)14-5-15-12(8)18/h5-7,9-10,13,17,19H,4H2,1-3H3
charge 0 multiplicity 1
42 atoms
O  1.438766 1.052206 0.229018
O  1.049107 -2.370124 -0.888503
O  3.513269 -1.816225 0.149161
O  3.892023 2.657723 1.04062
O  -6.608146 0.50545 0.000506
N  -0.680288 0.207283 -0.408686
N  -2.350419 1.17569 -1.650954
N  -2.048222 -0.817105 1.399751
N  -4.440331 -0.405817 1.090963
N  -5.359709 0.78086 -0.655051
C  1.476318 -0.997856 -0.978923
C  2.962042 -0.678298 -0.581897
C  0.644737 -0.175434 0.037196
C  2.854551 0.606717 0.310789
C  3.752129 1.764136 -0.106386
C  -1.879715 -0.099442 0.248424
C  -1.024974 0.977229 -1.533166
C  -2.894671 0.500842 -0.543284
C  1.650644 -3.246445 -1.899623
C  4.941292 -1.663011 0.44719
C  -4.224985 0.314884 -0.070121
C  4.599643 3.89033 0.699842
C  -3.358796 -0.921795 1.752157
H  1.304646 -0.597313 -2.004318
H  3.580588 -0.486295 -1.487224
H  0.525397 -0.752071 0.975462
H  3.077809 0.322986 1.360013
H  3.300133 2.295327 -0.973364
H  4.752938 1.37753 -0.410623
H  -0.275423 1.390465 -2.202525
H  2.735202 -3.363594 -1.720098
H  1.472795 -2.854528 -2.924183
H  1.146674 -4.218349 -1.786795
H  5.131109 -0.832903 1.157587
H  5.530816 -1.489554 -0.479038
H  5.2536 -2.611949 0.909242
H  5.632204 3.685542 0.342048
H  4.645246 4.484098 1.625618
H  4.057375 4.465438 -0.080119
H  -3.577585 -1.479825 2.666413
H  -5.440365 1.367711 -1.480612
H  -6.259325 -0.038012 0.796495
