program: Gaussian 09
title: 000174699
version: EM64L-G09RevD.01
frameworkgroup: C1[X(C9H10O6S)]
method: RPBEPBE
basis: SDD
operation: Freq
keyword: #p
keyword: freq=noraman
keyword: PBEPBE/SDD
title: #p freq=noraman PBEPBE/SDD
converged: NO YES NO NO
title: Mulliken charges:
elementType: S O O O O O O C C C C C C C C C H H H H H H H H H H
charge: 1.164865 -0.384880 -0.240694 -0.308656 -0.554029 -0.476432 -0.454358 0.213736 0.188470 -0.440958 -0.299674 0.372535 -0.382490 0.223291 -0.776128 -0.534670 0.288421 0.245221 0.252980 0.244845 0.248818 0.274567 0.259175 0.228408 0.231762 0.415876
chargesum: 0.00000
title: Mulliken charges with hydrogens summed into heavy atoms:
elementType: S O O O O O O C C C C C C C C C
charge: 1.164865 -0.384880 -0.240694 -0.308656 -0.138153 -0.476432 -0.454358 0.213736 0.188470 -0.152538 -0.054453 0.372535 -0.129510 0.223291 -0.007898 0.184675
polarizability: 2.43482411e+02 -1.00737807e+00 1.78814592e+02 -4.80875093e+00 5.36777705e+00 8.67352878e+01
1716.lowfreq: -11.1688 -2.2309 -0.0019 -0.0005 0.0020 3.5712 9.0553 52.2908 72.6240
frequency: -9.9683 52.2825 72.6175 87.9858 98.5616 128.2879 148.2618 161.1112 186.5131 196.4014 209.3184 232.9787 256.9636 276.8078 299.0443 321.9119 327.0128 344.8923 351.8024 410.7363 440.3859 470.8502 521.8593 549.8455 580.4126 595.7491 641.9573 648.5281 693.5816 723.0717 744.3721 810.7714 863.4805 899.2119 903.7132 946.7300 968.4673 973.8082 994.5268 995.7963 1029.3318 1062.8742 1110.6886 1127.2094 1144.8870 1183.4585 1234.5914 1276.7851 1292.0947 1365.1298 1371.6067 1381.7999 1416.0950 1435.4644 1446.9508 1463.2722 1467.3253 1470.8784 1474.0533 1518.5320 1554.2438 1604.4760 2076.0104 2974.9410 2992.9026 3070.1473 3082.4678 3133.7413 3141.3254 3153.7173 3177.5997 3185.4399
redmass: 10.1571 6.0823 4.9763 3.8619 4.0499 9.4072 1.0886 8.5691 4.9320 4.9991 1.1899 6.7015 4.6755 3.7094 10.2788 7.7736 7.1466 7.5376 10.3995 9.1965 5.1985 3.6632 4.3285 6.8759 3.6378 4.1047 4.6369 7.2348 4.9690 5.7555 3.3112 1.4747 13.6525 1.7082 5.9014 1.3597 1.8394 1.8679 3.6465 3.6391 1.6510 2.5402 1.2578 2.3907 1.4315 1.4787 2.5778 2.1488 3.1252 2.7252 1.3572 1.3124 4.9145 1.2152 1.1489 1.0718 1.0797 1.0494 2.9743 3.1804 5.6618 6.2891 1.1336 1.0325 1.0397 1.1048 1.0941 1.1004 1.1003 1.0876 1.0953 1.0931
irintensity: 0.5360 2.3110 0.4779 2.4431 2.2898 1.2203 0.7275 0.7776 0.5472 1.7472 0.1658 9.6054 6.3096 2.0972 7.7137 5.0450 1.7376 18.3163 19.0259 68.3964 4.8751 4.6798 27.8960 2.7099 20.6556 10.9938 22.7020 34.9077 18.0865 4.8866 1.3250 45.1225 110.9982 27.6881 6.0456 3.0946 27.4222 30.1526 164.7203 65.8754 0.7839 47.3658 0.1136 124.3044 1.8795 3.1010 145.3238 202.7776 134.8354 98.0285 266.8590 59.0971 0.0080 2.5045 22.5710 23.2330 42.4662 16.9290 14.4623 187.4316 111.9343 245.0959 1121.0887 57.6704 1.3424 35.2216 7.6403 7.9805 16.0363 4.1454 7.9928 1.2546
temp: 298.150 k
press: 1.00000 atm
elementType: 16 8 8 8 8 8 8 6 6 6 6 6 6 6 6 6 1 1 1 1 1 1 1 1 1 1
symmnumber: 1
zpe: 469837.2 jmol-1
zpe.correction: 0.178952 hartree
zpe.thermalcorrener: 0.194761 hartree
zpe.thermalcorrenthalpy: 0.195705 hartree
zpe.thermalcorrgfe: 0.136002 hartree
zpe.sumelectzpe: -1196.961594 hartree
zpe.sumelectthermal: -1196.945785 hartree
zpe.sumelectthermalent: -1196.944840 hartree
zpe.sumelectthermalfe: -1197.004543 hartree
dipole: -10.0352 5.2974 0.6672
dipole: 11.3672
quadrupole: -91.8830 -94.2529 -106.2647
quadrupole: 4.9146 -2.5235 1.2945
quadrupole: 5.5839 3.2139 -8.7978 4.9146 -2.5235 1.2945
hfenergy: -1197.1405452 hartree
pointgroup: C01 [X(C9H10O6S1)]
dipole: -3.4287387 2.8497391 0.3509252 debye
dipolederiv: 1.5910711 -0.1781958 -0.0067051 -0.4348281 1.815694 -0.0275169 0.3429193 -0.3185826 1.3235252 -0.4607379 0.1635876 0.0010613 0.2528726 -0.5219276 0.0289568 0.1558762 -0.1328178 -0.3796898 -1.8892519 -0.352284 0.1068494 -0.7226758 -0.4693519 0.0447063 0.1039426 0.0071326 -0.2894557 -1.284328 -0.0373557 -0.0078965 0.3299597 -0.768385 0.0322014 0.0212627 0.1164949 -0.2793086 -0.8120297 0.1395163 -0.0061887 -0.15849 -1.0046889 -0.0866492 -0.1803812 0.1307866 -0.5244775 -0.3813216 -0.0427796 0.0994544 0.1280112 -0.5427264 0.0253941 -0.2162808 0.3013068 -0.5905504 -0.5803009 0.1954704 0.0455429 0.3238923 -0.7271914 -0.0282741 0.0736254 -0.0701881 -0.4206316 -0.8972581 -0.5120213 0.0051611 -0.5090248 -0.6379039 -0.0390024 -0.0319899 0.0119608 -0.0485547 0.6350704 -0.187806 -0.0638844 0.1922464 0.5774461 0.1007643 -0.2313585 0.2596342 0.0490302 -0.806177 -0.1495063 0.019388 0.1134977 -0.0385932 0.0725016 0.1867667 0.0230378 -0.0812126 0.3528732 0.3891909 -0.0645221 0.0016632 0.1088965 0.0417369 0.0067532 0.0288868 -0.0528496 1.6626569 0.3816643 -0.0435818 0.8742103 0.5341354 -0.0404311 -0.0109194 0.024821 0.141314 -0.2452678 -0.1677838 -0.0425185 -0.4269714 -0.4947745 0.0608584 -0.1413244 -0.0484563 -0.1703403 1.5955663 0.6419312 0.0211626 0.3229434 1.2657473 -0.0374751 0.0067708 0.0307364 0.1561144 0.0213844 0.0703085 0.0064857 -0.0666193 -0.5632634 -0.0225883 -0.0632297 -0.1517805 0.0147542 0.9725925 0.0737669 -0.0734727 -0.2362763 0.1909356 -0.001383 -0.2184167 -0.0507156 0.3221341 0.1018123 0.0034064 0.0174997 0.0033574 0.0338253 -0.0337496 0.011147 -0.0256761 0.1350149 0.0968197 -0.0009312 -0.0049398 0.0068387 -0.0605769 -0.0545327 0.0192967 -0.0731786 0.1190589 -0.0393525 0.0474859 0.0524419 0.061773 0.0783005 -0.0368664 0.0504107 -0.0365723 0.144299 0.0828162 0.0273307 0.0796341 -0.0110675 0.0675026 -0.0085747 0.059435 -0.020903 -0.0342987 0.0075615 0.0302805 -0.1060318 0.0088805 0.0723028 0.0142036 -0.0795727 0.0452328 0.0276653 -0.0356867 -0.093931 0.0288379 -0.0184907 0.0810931 0.0117321 0.0309218 0.0419251 0.1232931 -0.0469748 -0.0773224 0.0052245 -0.1348766 0.0056831 -0.0137844 -0.0055808 -0.0210939 0.1238714 -0.0298967 -0.0015419 0.0104144 0.1891932 -0.0338539 0.0957454 0.0080906 0.1002528 -0.0048977 -0.0189818 -0.0218309 -0.0466734 0.1205232 0.0775413 -0.0873186 0.0669837 -0.0382798 -0.1227327 0.4073409 -0.3406496 -0.0327432 -0.2105422 0.9541333 -0.0106546 0.0348517 -0.1339639 0.3189251 unknown
polarizability: 240.1473765|-13.782416|181.8426995|-6.5507839|7.3363605|87.0422149 unknown
InChI: InChI=1S/C9H10O6S/c1-6(10)8-4-3-7(14-2)5-9(8)15-16(11,12)13/h3-5,11H,1-2H3
charge 0 multiplicity 1
26 atoms
S  2.200039 -2.130253 0.184514
O  1.118186 -0.944669 -1.05984
O  -3.524709 -1.229646 -0.046791
O  2.492733 1.329871 0.058934
O  3.438536 -0.944653 0.448966
O  1.290972 -2.387462 1.491334
O  2.768722 -3.353915 -0.673722
C  0.069892 1.038431 -0.03989
C  0.016702 -0.338424 -0.490279
C  -1.20189 -1.048365 -0.472487
C  -1.157393 1.638944 0.356822
C  -2.393193 -0.427993 -0.027045
C  -2.371898 0.933803 0.385828
C  1.314044 1.835567 0.011783
C  1.233481 3.355091 0.032679
C  -4.799363 -0.653799 0.408714
H  -1.225625 -2.084322 -0.820736
H  -1.160904 2.684294 0.680472
H  -3.280187 1.436522 0.727984
H  0.902847 3.713732 1.02625
H  0.526447 3.742605 -0.719995
H  2.23884 3.759704 -0.155305
H  -5.527821 -1.470426 0.310853
H  -5.101062 0.197292 -0.230206
H  -4.733815 -0.333474 1.465253
H  3.008122 0.035846 0.24661
