program: Gaussian 09
title: 000174709
version: EM64L-G09RevD.01
frameworkgroup: C1[X(C13H16F3NO2)]
method: RPBEPBE
basis: SDD
operation: Freq
keyword: #p
keyword: freq=noraman
keyword: PBEPBE/SDD
title: #p freq=noraman PBEPBE/SDD
converged: YES YES NO NO
title: Mulliken charges:
elementType: F F F O O N C C C C C C C C C C C C C H H H H H H H H H H H H H H H H
charge: -0.154795 -0.163491 -0.154622 -0.267900 -0.203229 -0.157487 0.483492 -0.382178 -0.583564 -0.544200 -0.393289 0.470227 -0.662493 0.295827 -0.227055 -0.426806 -0.816750 -0.366040 0.433013 0.231947 0.233460 0.281403 0.273810 0.228437 0.229234 0.213321 0.236558 0.216872 0.217856 0.230569 0.220018 0.234258 0.224685 0.270322 0.278593
chargesum: 0.00000
title: Mulliken charges with hydrogens summed into heavy atoms:
elementType: F F F O O N C C C C C C C C C C C C C
charge: -0.154795 -0.163491 -0.154622 -0.267900 -0.203229 -0.157487 0.483492 0.083229 -0.028351 -0.315763 -0.164055 0.470227 0.004258 0.295827 -0.009199 -0.196237 -0.137790 0.182875 0.433013
polarizability: 1.91099959e+02 -5.22402051e+00 1.79546207e+02 -1.13786011e+01 -3.95842190e+00 1.05981898e+02
1716.lowfreq: -4.3276 0.0002 0.0004 0.0007 2.0292 8.0113 13.6514 25.0926 35.5577
frequency: 12.6294 24.6250 35.4554 38.4001 44.0933 52.9929 57.9823 68.8580 89.5082 158.8853 198.0431 210.2927 210.7926 227.1150 230.2739 256.6118 273.9950 335.7022 341.5553 385.7044 397.0445 410.1112 446.7871 462.7693 484.3149 508.0155 514.6360 527.3035 570.2989 577.9705 591.5633 662.7295 695.9830 708.4830 765.5947 777.1521 786.5554 812.5219 834.5888 851.1659 867.5089 906.3186 918.4535 964.3080 966.0121 978.4495 990.4134 998.5769 1028.8987 1044.5445 1049.2859 1061.3305 1080.3339 1100.9964 1111.4865 1136.5303 1185.1392 1189.5662 1214.2432 1218.7775 1257.8489 1268.0032 1284.7271 1323.2632 1335.7574 1351.5903 1366.4686 1380.1631 1386.7067 1391.1995 1395.2918 1438.4773 1444.3643 1454.0634 1468.0481 1473.1261 1478.0195 1480.4104 1491.6462 1503.4131 1590.4094 1620.3692 1682.3650 2973.4321 2982.2138 2993.7788 3002.4424 3039.1648 3049.8911 3054.7063 3058.5355 3078.4450 3081.8232 3091.5407 3121.6167 3124.2446 3129.8665 3143.5833 3166.1278
redmass: 6.2542 6.2872 1.1110 4.4217 4.2461 7.8305 8.5303 5.4323 2.9243 3.7687 3.0941 3.0455 1.6917 7.9589 3.1115 3.5075 4.9854 3.2458 2.8744 3.2470 3.4628 4.9947 2.9626 6.8137 7.0632 2.7166 3.6871 4.6960 4.1380 3.7903 7.3481 5.6458 1.9666 4.3945 7.0886 1.5436 1.2139 4.5888 3.4193 1.4032 1.4815 3.1405 2.4441 1.4989 3.1373 5.4503 2.0953 2.0527 10.2539 1.5672 2.1983 4.7722 1.9657 1.6371 2.4830 1.7601 1.7528 1.1287 6.1557 1.9888 1.8451 1.2448 1.3802 1.3389 1.3242 1.3165 1.3910 5.5249 1.7682 1.3647 1.2869 1.6930 1.1077 1.2288 1.0466 1.0741 1.2893 1.1665 1.3361 1.6671 5.9293 6.0189 9.7784 1.0382 1.0358 1.0620 1.0620 1.0591 1.1015 1.0954 1.0993 1.0995 1.0997 1.1011 1.0860 1.1054 1.0898 1.0937 1.0957
irintensity: 0.5166 0.7443 0.5120 0.0569 0.4025 0.7758 1.3439 3.2073 1.1689 0.3485 0.0537 3.7006 1.4157 1.1275 2.9473 7.3761 1.4451 4.1033 0.8664 5.6987 3.0941 11.5044 4.0023 0.8166 21.4611 4.1179 0.1660 1.3586 2.9730 9.4737 15.6566 16.5672 21.3200 2.7531 25.1941 57.1329 21.8722 25.7140 6.7474 10.2980 4.9159 98.5572 20.4835 5.0069 27.8457 6.6626 32.2661 18.8718 247.4952 18.1555 63.4950 345.1450 13.5541 4.7622 75.7728 1.7376 25.9319 20.6883 144.5022 13.9748 42.2563 54.8801 25.7324 6.4409 3.2100 47.2275 43.4239 5.2780 31.4562 41.6553 9.7273 20.1738 17.3548 30.0666 9.5513 12.2813 6.3562 10.9963 40.9458 110.9195 34.7936 214.3778 132.4872 36.8257 27.6552 19.9737 33.1577 24.3411 4.8305 23.7032 3.5628 45.7730 20.7059 44.0036 5.0125 0.5446 30.7728 26.3731 18.6477
temp: 298.150 k
press: 1.00000 atm
elementType: 9 9 9 8 8 7 6 6 6 6 6 6 6 6 6 6 6 6 6 1 1 1 1 1 1 1 1 1 1 1 1 1 1 1 1
symmnumber: 1
zpe: 709429.9 jmol-1
zpe.correction: 0.270208 hartree
zpe.thermalcorrener: 0.290085 hartree
zpe.thermalcorrenthalpy: 0.291029 hartree
zpe.thermalcorrgfe: 0.217431 hartree
zpe.sumelectzpe: -1008.264297 hartree
zpe.sumelectthermal: -1008.244420 hartree
zpe.sumelectthermalent: -1008.243476 hartree
zpe.sumelectthermalfe: -1008.317073 hartree
dipole: 1.3107 -0.0942 0.7131
dipole: 1.4951
quadrupole: -123.3935 -97.4795 -117.9681
quadrupole: 5.8321 -0.2123 1.6465
quadrupole: -10.4465 15.4676 -5.0211 5.8321 -0.2123 1.6465
hfenergy: -1008.5345047 hartree
pointgroup: C01 [X(C13H16F3N1O2)]
dipole: -0.5066064 -0.0769499 -0.2888123 debye
polarizability: 190.8185153|5.5984617|180.374824|-10.0689493|1.4738487|105.4347242 unknown
InChI: InChI=1S/C13H16F3NO2/c1-3-17(11-6-4-5-10(2)7-11)8-12(18)19-9-13(14,15)16/h4-7H,3,8-9H2,1-2H3
charge 0 multiplicity 1
35 atoms
F  4.822639 -0.179235 -1.237001
F  5.467091 -0.38995 0.930427
F  4.261447 1.423423 0.263033
O  2.027485 -0.258311 -0.391861
O  1.02008 0.719237 1.487774
N  -1.283202 1.333339 -0.251061
C  -2.234631 0.302805 -0.08888
C  -1.531475 2.708733 0.229605
C  0.031835 1.03859 -0.786195
C  -1.889467 -1.065008 -0.316601
C  -3.577931 0.597207 0.295274
C  -2.835803 -2.106409 -0.172319
C  -2.151688 3.636305 -0.840618
C  1.027204 0.513353 0.263791
C  -4.516717 -0.441968 0.443726
C  -4.163416 -1.78915 0.209433
C  -2.418163 -3.552607 -0.388094
C  3.13466 -0.736797 0.44682
C  4.405237 0.030929 0.092758
H  -2.179118 2.663437 1.123385
H  -0.569393 3.128969 0.577713
H  -0.009187 0.31731 -1.620948
H  0.480836 1.962029 -1.200811
H  -0.865808 -1.340862 -0.594411
H  -3.898451 1.629844 0.459166
H  -1.488259 3.724102 -1.720598
H  -3.123778 3.247322 -1.190417
H  -2.308977 4.65097 -0.429422
H  -5.543772 -0.191221 0.734138
H  -4.907127 -2.586227 0.32127
H  -1.557043 -3.631361 -1.075233
H  -2.123825 -4.027797 0.56807
H  -3.246001 -4.150857 -0.80844
H  3.285026 -1.803665 0.222618
H  2.904593 -0.58418 1.516109
