program: Gaussian 09
title: 000174666
version: EM64L-G09RevD.01
frameworkgroup: C1[X(C7H13IO2)]
method: RPBEPBE
basis: SDD
operation: Freq
keyword: #p
keyword: freq=noraman
keyword: PBEPBE/SDD
title: #p freq=noraman PBEPBE/SDD
converged: NO NO NO NO
title: Mulliken charges:
elementType: I O O C C C C C C C H H H H H H H H H H H H H
charge: 0.011406 -0.416177 -0.231746 -0.361273 -0.370558 -0.372494 -0.295910 -0.486783 -0.787876 0.173767 0.194703 0.194891 0.200252 0.200497 0.218611 0.218548 0.226001 0.225855 0.253066 0.253195 0.287504 0.287474 0.377049
chargesum: 0.00000
title: Mulliken charges with hydrogens summed into heavy atoms:
elementType: I O O C C C C C C C
charge: 0.011406 -0.039128 -0.231746 0.028322 0.030191 0.064664 0.155946 0.019477 -0.212898 0.173767
polarizability: 1.59635410e+02 -1.11692322e+01 8.72569643e+01 -7.86184393e-02 5.25439536e-03 6.47791354e+01
1716.lowfreq: -0.0002 0.0002 0.0003 3.4633 6.9974 18.6415 24.9862 33.6838 46.4841
frequency: 23.3633 32.8346 46.4744 75.6224 83.0079 106.9163 137.2373 141.3056 167.4860 239.6219 337.2454 401.3460 483.8391 504.1457 580.1323 592.3297 641.5057 726.7273 735.9192 766.6445 845.9030 857.4869 944.1685 992.0628 1018.6136 1037.0871 1038.3937 1067.9062 1078.4964 1095.6684 1118.7442 1193.9227 1207.9741 1229.8644 1254.5821 1257.5810 1280.1965 1293.1564 1296.6693 1299.3900 1334.8412 1355.0704 1375.8273 1438.8903 1446.4390 1464.2337 1465.8529 1475.0206 1485.8932 1662.6246 2955.3785 2963.8075 2986.0362 2992.8669 2995.2929 2995.4711 3018.9796 3031.0262 3049.7975 3054.2160 3062.3941 3134.4953 3505.7213
redmass: 4.7198 3.4555 5.8404 1.9910 2.6082 9.1184 1.9768 2.1852 5.8489 4.8885 5.0697 3.7566 3.8008 1.7965 4.5728 4.5658 1.3082 1.0908 1.0974 1.2463 1.3408 4.7961 1.3062 5.0021 4.1344 1.1145 3.0388 2.7025 2.4291 2.9880 1.4136 1.1807 1.5101 1.3108 1.2774 1.4586 1.0871 1.0987 1.0909 1.4292 1.4677 1.5782 1.8424 1.0856 1.1033 1.0777 1.0673 1.0950 1.1003 8.1231 1.0590 1.0590 1.0614 1.0597 1.0769 1.0806 1.1022 1.1001 1.0562 1.1042 1.1034 1.1104 1.0639
irintensity: 1.8834 0.0088 0.9525 0.6126 0.0568 0.1378 0.0601 0.0195 1.3851 5.9567 11.9218 0.7039 16.9821 28.1751 7.5805 44.2963 130.8096 17.6762 4.7775 8.5057 0.2334 1.5200 3.7308 57.5187 14.8598 0.9084 191.6177 5.6666 16.5529 30.9195 0.8439 15.1768 0.2115 45.1153 1.2035 43.8301 0.0127 0.1267 0.4543 4.7128 32.2026 13.2163 29.6714 27.9108 4.2020 0.6692 1.9986 0.2643 23.6567 210.5346 5.7109 39.0630 5.3733 10.3127 28.6287 25.2074 15.3793 2.0999 19.4565 8.7047 99.4384 13.4244 19.6829
temp: 298.150 k
press: 1.00000 atm
elementType: 53 8 8 6 6 6 6 6 6 6 1 1 1 1 1 1 1 1 1 1 1 1 1
symmnumber: 1
zpe: 499331.7 jmol-1
zpe.correction: 0.190185 hartree
zpe.thermalcorrener: 0.202839 hartree
zpe.thermalcorrenthalpy: 0.203783 hartree
zpe.thermalcorrgfe: 0.146635 hartree
zpe.sumelectzpe: -435.697237 hartree
zpe.sumelectthermal: -435.684583 hartree
zpe.sumelectthermalent: -435.683639 hartree
zpe.sumelectthermalfe: -435.740788 hartree
dipole: -2.0694 -0.7255 0.0027
dipole: 2.1929
quadrupole: -83.8894 -80.9515 -75.1949
quadrupole: 8.4065 -0.0120 0.0207
quadrupole: -3.8775 -0.9396 4.8171 8.4065 -0.0120 0.0207
hfenergy: -435.8874227 hartree
pointgroup: C01 [X(C7H13I1O2)]
dipole: -0.8227019 0.2597652 -0.0025366 debye
dipolederiv: -0.563792 -0.0437872 -0.0031014 -0.1662715 -0.1528928 -0.0013205 -0.0045432 -0.0005617 -0.1158438 -1.0706617 0.5418168 0.0000891 0.4880465 -0.6200536 0.0020282 -0.0014483 0.0025437 -0.4316855 -0.7031279 -0.1579687 -0.0037676 0.1014471 -0.9660087 -0.0046817 -0.0020074 -0.0068746 -0.3042388 -0.0304919 -0.002297 -0.0011064 -0.129335 0.0790086 -0.0021289 -0.0025336 -0.0012774 0.1898117 -0.1233515 0.0044707 -0.0015769 0.2746427 0.1215211 0.0011164 0.0014118 -0.001009 0.1908991 0.0078942 -0.0011123 -0.0007368 0.0863307 0.0603947 -0.0008268 0.0012695 -0.0009475 0.156756 -0.2584604 0.0045685 -0.0022016 -0.2584249 0.0063662 -0.0030907 -0.0043025 -0.0006738 0.1363565 -0.2928889 -0.1002623 -0.004339 -0.3221865 -0.0993611 -0.0050333 -0.0084443 -0.0043075 0.1552179 0.8354712 0.2352996 0.0071409 0.2741178 0.163368 0.0028673 0.007419 0.0022451 0.0688649 1.540022 -0.1765685 0.0088727 -0.246614 1.3807692 0.0080705 0.0102782 0.0089773 0.1843346 0.0334067 -0.0024363 -0.0070927 0.0046756 -0.0338181 -0.1120961 0.0000633 -0.1315514 -0.0881897 0.0332526 -0.0037225 0.0080519 0.0036809 -0.0396398 0.1132825 0.0009637 0.1325743 -0.0821241 0.060245 -0.0029342 0.0064001 -0.0097752 -0.0369633 0.1105871 0.007152 0.133348 -0.0759738 0.0597991 -0.0020092 -0.0052509 -0.0090464 -0.0315005 -0.1097085 -0.0065342 -0.132338 -0.0815282 0.0581812 0.0052912 -0.001585 0.0063555 -0.0132076 0.101673 0.0141463 0.1096716 -0.0612532 0.0577786 0.0056854 0.0024448 0.007361 -0.0075826 -0.1003448 -0.013511 -0.1083301 -0.0671537 0.0662656 -0.0015717 -0.0038 0.0207631 -0.0154361 0.1000453 -0.0018696 0.1094099 -0.0555931 0.0664539 -0.0001979 0.0053574 0.0220292 -0.0121401 -0.0990299 0.0037075 -0.1088319 -0.0589394 0.0660996 -0.0092659 -0.0005041 0.0393701 0.0385812 -0.0835719 0.0155079 -0.1059175 -0.0181526 0.0661345 -0.0100402 0.0009805 0.0394035 0.0324869 0.0857101 -0.012685 0.1075418 -0.0120311 -0.0563738 -0.0910305 0.0431833 -0.0353179 -0.0227458 0.0868622 -0.0220504 0.091454 -0.0087469 -0.0560143 -0.0890403 -0.0453838 -0.0343707 -0.0196962 -0.087652 0.0208489 -0.0928167 -0.0120862 0.204158 -0.1028877 -0.0020745 -0.1568816 0.1885504 -0.0027574 -0.0028386 -0.0023286 0.3912992 unknown
polarizability: 158.8603783|13.4108418|88.0249313|0.6851537|0.3113626|64.7861997 unknown
InChI: InChI=1S/C7H13IO2/c8-6-4-2-1-3-5-7(9)10/h9H,1-6H2
charge 0 multiplicity 1
23 atoms
I  6.055797 0.398058 0.059713
O  -4.605313 0.858051 0.00715
O  -3.727164 -1.29073 -0.003701
C  0.346889 0.476705 0.029748
C  1.568777 -0.471705 0.02348
C  -0.996257 -0.285468 0.015184
C  2.913857 0.300618 0.037431
C  -2.204106 0.670359 0.024726
C  4.100997 -0.667866 0.036922
C  -3.536786 -0.053874 0.008189
H  0.395825 1.12902 0.926731
H  0.403037 1.150371 -0.850825
H  1.514844 -1.144071 0.90465
H  1.521804 -1.123458 -0.873391
H  -1.056403 -0.961134 0.889997
H  -1.051338 -0.937193 -0.877869
H  2.971263 0.96468 -0.846152
H  2.960923 0.950904 0.931977
H  -2.188072 1.327235 0.917182
H  -2.180564 1.355917 -0.845486
H  4.130537 -1.305127 0.93464
H  4.142461 -1.289985 -0.870901
H  -5.465006 0.354494 -0.003197
