program: Gaussian 09
title: 000174622
version: EM64L-G09RevD.01
frameworkgroup: C1[X(C17H21NO3)]
method: RPBEPBE
basis: SDD
operation: Freq
keyword: #p
keyword: freq=noraman
keyword: PBEPBE/SDD
title: #p freq=noraman PBEPBE/SDD
converged: YES YES NO NO
title: Mulliken charges:
elementType: O O O N C C C C C C C C C C C C C C C C C H H H H H H H H H H H H H H H H H H H H H
charge: -0.247670 -0.294693 -0.214401 -0.475107 0.122562 0.159713 -0.115163 -0.499787 0.187469 0.001302 -0.325096 -0.527940 0.440046 -0.444120 -0.547863 -0.448115 -0.243006 0.272754 -0.683696 -0.257407 -0.661931 0.218960 0.210654 0.236645 0.323538 0.191991 0.224243 0.261705 0.214611 0.233474 0.219799 0.204669 0.225773 0.217236 0.215829 0.218677 0.229449 0.242740 0.220704 0.218429 0.222046 0.250979
chargesum: 0.00000
title: Mulliken charges with hydrogens summed into heavy atoms:
elementType: O O O N C C C C C C C C C C C C C C C C C
charge: -0.247670 -0.294693 -0.214401 -0.151569 0.122562 0.159713 0.103797 -0.052489 0.187469 0.001302 0.091138 -0.051624 0.440046 -0.210645 -0.123396 -0.222343 -0.025770 0.272754 -0.019741 0.206037 0.029522
polarizability: 2.28910380e+02 -2.02348623e+01 2.11973324e+02 2.21356425e+01 1.86674014e+01 1.51930421e+02
1716.lowfreq: -16.2591 -10.6104 -0.0002 0.0005 0.0008 0.9141 3.5092 19.8584 39.2810
frequency: -12.6616 19.4623 39.2549 56.2430 62.7361 78.4709 89.4635 106.2728 127.5091 133.3677 175.5767 192.8839 210.1259 226.9723 257.9578 266.0327 283.0675 299.6946 322.1216 339.2648 370.3235 409.4107 419.1529 451.1489 477.7788 499.7944 505.9105 541.1036 545.7142 566.6227 586.2256 604.3431 640.2302 672.3697 718.7870 732.8492 745.5566 752.5574 781.3801 796.5271 799.7304 814.7172 827.2743 853.0001 873.1721 891.0003 903.5604 930.1010 955.7553 959.7530 982.2977 1000.2746 1015.9582 1031.7262 1033.9729 1058.5163 1064.0362 1074.7410 1095.1074 1107.4148 1124.0091 1155.7550 1161.4760 1172.1562 1192.0943 1218.6374 1233.7311 1238.1059 1239.8483 1252.0212 1266.3494 1278.3994 1279.4512 1308.8944 1315.1160 1320.0280 1345.3079 1355.9606 1358.3266 1372.7052 1387.7047 1390.3601 1399.0919 1429.4392 1439.5111 1453.7966 1457.8409 1458.2648 1463.2022 1466.1959 1471.2874 1475.9225 1484.2727 1489.0248 1492.5025 1587.0706 1598.0996 1625.3180 1661.2003 2877.5789 2948.5237 2968.6955 2973.2826 2978.1681 2992.2876 3022.5511 3028.5767 3031.4381 3034.0405 3072.7594 3082.6261 3086.3066 3086.5812 3092.7024 3099.3406 3115.9334 3118.0950 3130.7682 3154.0963 3597.8738
redmass: 3.5009 3.9308 4.4457 2.9046 3.6941 3.8757 3.9320 3.9768 3.0146 4.3705 3.4585 1.7158 1.2355 2.1211 2.8307 3.5159 2.4555 2.2410 2.7936 3.8854 2.7695 4.6117 3.6248 3.1600 1.5494 3.7049 3.5650 3.6819 4.2393 3.9153 3.9159 4.1563 4.3629 6.4796 3.3775 2.8483 3.5154 1.8819 1.3340 1.9226 2.3185 1.8584 3.9526 3.7734 2.8498 1.4181 2.9895 2.5648 2.4460 1.3263 2.6037 2.4840 2.9904 2.3683 3.4631 2.3678 2.0129 1.8581 2.1654 1.7347 2.6295 1.7014 2.6221 1.2261 1.2454 1.2850 1.9187 1.3525 1.5909 1.5210 1.5410 1.3969 1.1414 1.3857 1.7246 1.6674 1.3910 1.5209 1.3472 1.8543 1.2398 1.2344 2.9324 4.1058 1.1473 1.1396 1.0891 1.1721 1.0472 3.1823 1.0542 1.0961 1.0520 1.3757 2.0380 8.3597 6.7127 6.9893 9.6266 1.0814 1.0690 1.0636 1.0594 1.0356 1.0360 1.1006 1.0598 1.0592 1.0966 1.0994 1.1008 1.0967 1.0980 1.1028 1.1025 1.0866 1.1061 1.0904 1.0988 1.0797
irintensity: 0.4625 0.4956 0.6705 0.1848 0.8874 1.3919 0.3848 0.4596 0.0527 1.1324 2.3071 0.2987 1.9675 0.3732 2.9291 5.8943 0.7437 7.8311 2.8410 7.3667 10.1560 3.3359 3.3422 11.3955 83.8197 13.4683 14.8983 4.3425 7.7656 0.3019 10.4572 4.9270 1.5724 3.0604 7.5299 13.9820 13.0036 34.5613 3.3769 5.9378 26.2186 0.7027 1.2213 1.7645 2.7733 0.1533 26.9714 10.7622 7.4765 0.9448 3.8820 3.3561 82.8622 32.0997 31.4618 7.4046 9.7397 7.5515 23.1619 8.6415 189.8480 1.3969 34.2065 4.3956 0.5838 23.2621 16.5121 25.9835 22.9333 2.8063 43.3936 4.9859 3.2918 9.5955 13.3895 20.0499 47.2622 20.9881 4.0050 9.4680 16.7372 20.6985 11.2592 8.2251 14.5599 11.5639 9.4569 6.4025 13.6937 13.5341 5.2684 7.6061 13.9051 12.6630 3.6102 0.4569 3.5204 0.3978 164.3221 64.6798 73.3609 42.3778 41.7964 32.8503 21.0801 30.8336 12.3813 22.3474 9.0972 73.4477 31.4098 40.8935 28.8248 3.9570 5.0713 6.8852 26.8579 18.8882 36.4765 48.9193
temp: 298.150 k
press: 1.00000 atm
elementType: 8 8 8 7 6 6 6 6 6 6 6 6 6 6 6 6 6 6 6 6 6 1 1 1 1 1 1 1 1 1 1 1 1 1 1 1 1 1 1 1 1 1
symmnumber: 1
zpe: 910879.0 jmol-1
zpe.correction: 0.346935 hartree
zpe.thermalcorrener: 0.366446 hartree
zpe.thermalcorrenthalpy: 0.367390 hartree
zpe.thermalcorrgfe: 0.298123 hartree
zpe.sumelectzpe: -939.280440 hartree
zpe.sumelectthermal: -939.260929 hartree
zpe.sumelectthermalent: -939.259985 hartree
zpe.sumelectthermalfe: -939.329252 hartree
dipole: -1.0556 1.9556 2.0499
dipole: 3.0234
quadrupole: -135.2035 -108.8879 -120.3159
quadrupole: 2.6347 7.7721 0.8503
quadrupole: -13.7344 12.5812 1.1532 2.6347 7.7721 0.8503
hfenergy: -939.627375 hartree
pointgroup: C01 [X(C17H21N1O3)]
dipole: 0.5493646 -0.6790232 0.8074775 debye
polarizability: 234.5410835|-16.8924292|205.2188028|-19.6823252|-22.5382827|153.0542385 unknown
InChI: InChI=1S/C17H21NO3/c1-3-11-6-5-7-12-13-8-9-21-14(10-15(19)20-4-2)17(13)18-16(11)12/h5-7,14,18H,3-4,8-10H2,1-2H3
charge 0 multiplicity 1
42 atoms
O  -2.605866 1.994949 0.374701
O  -1.634975 -2.056617 0.103186
O  -3.427206 -0.997618 -0.958271
N  0.503746 -0.045001 1.041985
C  -0.439582 0.92184 0.656815
C  0.137682 1.806837 -0.250757
C  -1.839228 1.051369 1.208254
C  -0.62819 2.980708 -0.808886
C  1.499475 1.360759 -0.473297
C  1.699292 0.189307 0.34189
C  -1.858495 3.240332 0.090564
C  -2.682161 -0.25079 1.285006
C  2.923864 -0.524415 0.384743
C  2.572099 1.837992 -1.272126
C  3.101167 -1.768645 1.242894
C  3.963738 -0.017147 -0.4267
C  3.794895 1.140891 -1.241445
C  -2.662179 -1.095404 0.022286
C  2.419168 -3.031213 0.646706
C  -1.47622 -2.952933 -1.086882
C  -2.394952 -4.172165 -0.972118
H  -1.793413 1.458865 2.247527
H  -0.002798 3.895225 -0.84198
H  -0.959167 2.775805 -1.845983
H  0.264901 -0.919522 1.50612
H  -1.538149 3.703723 1.049672
H  -2.597347 3.893893 -0.400862
H  -3.722326 0.059236 1.481665
H  -2.322731 -0.86152 2.131683
H  2.45153 2.728309 -1.89952
H  4.180828 -1.97307 1.366003
H  2.7011 -1.588063 2.261937
H  4.93357 -0.530268 -0.42136
H  4.637246 1.492129 -1.848168
H  1.329136 -2.886399 0.528072
H  2.575941 -3.909661 1.299641
H  2.835532 -3.262278 -0.350003
H  -1.69691 -2.365914 -1.99513
H  -0.410046 -3.230548 -1.066118
H  -2.206126 -4.861374 -1.816134
H  -2.210189 -4.720485 -0.031942
H  -3.454256 -3.867718 -1.007766
