program: Gaussian 09
title: 000174577
version: EM64L-G09RevD.01
frameworkgroup: C1[X(C8H15N3O5)]
method: RPBEPBE
basis: SDD
operation: Freq
keyword: #p
keyword: freq=noraman
keyword: PBEPBE/SDD
title: #p freq=noraman PBEPBE/SDD
converged: YES YES NO NO
title: Mulliken charges:
elementType: O O O O O N N N C C C C C C C C H H H H H H H H H H H H H H H
charge: -0.280046 -0.414384 -0.443580 -0.236201 -0.227384 -0.369180 -0.592638 -0.650015 -0.398763 -0.530153 -0.160581 -0.388742 -0.095142 0.242527 0.175705 0.170742 0.254521 0.219103 0.242892 0.218065 0.241235 0.239559 0.261709 0.248708 0.328848 0.273381 0.297837 0.317403 0.288152 0.376164 0.390258
chargesum: 0.00000
title: Mulliken charges with hydrogens summed into heavy atoms:
elementType: O O O O O N N N C C C C C C C C
charge: -0.280046 -0.038220 -0.053323 -0.236201 -0.227384 -0.040331 -0.021420 -0.044460 0.074861 -0.069195 0.080654 0.112526 0.153565 0.242527 0.175705 0.170742
polarizability: 1.54662678e+02 2.61325787e+00 1.25808088e+02 2.88429696e+00 5.25089333e+00 9.44850471e+01
1716.lowfreq: -4.4229 -0.0008 -0.0005 -0.0003 2.5544 9.7429 14.6742 25.5783 34.8591
frequency: 14.4294 25.5522 34.8188 44.0496 46.9936 62.4671 78.9320 97.2522 147.1127 171.0271 207.6627 229.3943 238.8851 263.7951 282.7038 289.4822 307.7564 331.5685 340.9814 376.4247 440.0709 487.6395 496.0072 507.9185 561.1568 572.8050 598.2064 611.2796 614.0272 626.8261 656.0584 675.5818 689.7009 714.1571 757.0508 782.9208 819.5284 878.2262 978.5610 993.9472 1017.2743 1028.5956 1046.3365 1049.9678 1053.9902 1092.5266 1117.5191 1136.7304 1143.2764 1178.6785 1181.8309 1216.6832 1223.7376 1256.3753 1261.2511 1270.7165 1288.6999 1299.6546 1319.4229 1335.5176 1352.7510 1380.9054 1398.4289 1437.9310 1454.4534 1466.2998 1486.8238 1609.2723 1613.1536 1613.2407 1672.0391 1673.0297 2870.6304 2979.9564 2990.8307 3016.7212 3020.7700 3036.5673 3065.1536 3094.3263 3469.6493 3499.6972 3509.2921 3514.2681 3547.5195 3606.2414 3651.6325
redmass: 5.6419 6.4040 7.0682 6.6849 6.9578 7.2811 4.9007 3.4558 3.4733 3.0824 5.4609 1.5124 1.2283 2.5789 3.3742 2.7681 3.1466 3.2809 3.4904 3.9494 4.1311 3.2876 1.4386 2.8659 2.0659 1.7104 2.6547 1.8219 1.3248 3.0807 1.1971 3.3565 2.9023 3.0950 2.4911 3.2419 1.8542 3.4351 2.2489 2.5609 3.6693 2.8720 3.6890 2.9495 2.8468 2.7384 1.8398 1.4275 1.3985 1.6624 1.7628 1.4640 1.6665 1.3269 1.5321 1.6508 1.2351 1.3087 1.2012 1.3585 1.6506 1.6981 1.7805 1.0890 1.1157 1.0980 1.9019 1.3138 2.2372 2.0531 3.6921 3.9345 1.0797 1.0612 1.0599 1.0846 1.0616 1.0991 1.1037 1.1031 1.0448 1.0638 1.0457 1.0640 1.0775 1.0987 1.1004
irintensity: 0.7026 0.0944 1.9222 2.5322 5.9782 1.3315 2.6374 4.0157 8.0400 0.8261 0.6763 8.9005 73.2277 9.0875 2.7874 6.1080 3.2254 6.4226 3.6504 4.5521 37.0524 17.3521 213.8650 82.9938 56.6688 120.1911 29.0049 96.6715 268.0863 25.1300 151.7234 47.0791 47.1881 41.5455 21.3332 8.4282 4.4760 4.1144 3.3734 13.2785 5.3689 14.9590 14.2492 139.2858 359.1723 0.5740 4.0187 6.5705 2.9620 12.3489 5.8904 4.5607 103.3650 9.8182 19.7723 35.4806 8.5787 18.9854 6.3907 1.0940 39.2511 3.2085 5.3967 14.0635 30.9271 17.2233 340.9817 179.5620 111.9442 204.6648 139.0607 157.6851 46.4786 6.6881 17.4371 28.1916 35.2742 7.3560 35.3035 4.6008 7.6452 19.1330 13.7191 33.8335 45.9061 9.2062 19.3404
temp: 298.150 k
press: 1.00000 atm
elementType: 8 8 8 8 8 7 7 7 6 6 6 6 6 6 6 6 1 1 1 1 1 1 1 1 1 1 1 1 1 1 1
symmnumber: 1
zpe: 643610.8 jmol-1
zpe.correction: 0.245138 hartree
zpe.thermalcorrener: 0.263560 hartree
zpe.thermalcorrenthalpy: 0.264504 hartree
zpe.thermalcorrgfe: 0.195071 hartree
zpe.sumelectzpe: -852.978654 hartree
zpe.sumelectthermal: -852.960232 hartree
zpe.sumelectthermalent: -852.959288 hartree
zpe.sumelectthermalfe: -853.028721 hartree
dipole: 1.3831 2.6445 0.4097
dipole: 3.0123
quadrupole: -115.5550 -90.1462 -93.3596
quadrupole: 0.5941 -5.0838 10.7971
quadrupole: -15.8681 9.5407 6.3274 0.5941 -5.0838 10.7971
hfenergy: -853.223792 hartree
pointgroup: C01[X(C8H15N3O5)]
dipole: -0.5357144 -1.0527682 0.0960376 debye
polarizability: 154.7131496|3.2200813|126.2696023|-0.4063048|-3.8018447|93.9730609 unknown
InChI: InChI=1S/C8H15N3O5/c9-4(7(13)14)1-2-6(12)11-3-5(10)8(15)16/h4-5,11,13,15H,1-3,9-10H2
charge 0 multiplicity 1
31 atoms
O  -0.245619 2.333857 0.429742
O  3.707373 -1.541614 1.280684
O  -2.828541 -1.931798 -0.047684
O  4.312317 -1.519441 -0.959551
O  -4.974442 -1.528971 -0.826289
N  -1.283816 0.285661 0.818651
N  4.698096 1.257784 -0.72947
N  -4.622564 1.197884 -0.708321
C  2.225072 0.927502 -0.213166
C  1.182505 0.359267 0.775273
C  3.716374 0.608208 0.150126
C  -2.645103 0.820635 0.743316
C  -3.425842 0.382801 -0.54096
C  -0.164464 1.08372 0.646682
C  3.95993 -0.894487 0.065437
C  -3.855685 -1.082365 -0.49793
H  2.114824 2.02853 -0.217605
H  2.023303 0.574244 -1.243031
H  1.544648 0.516694 1.811791
H  1.058265 -0.732706 0.652084
H  3.885597 0.919279 1.197815
H  -3.234571 0.543631 1.635505
H  -2.554388 1.919471 0.716575
H  -2.697945 0.456194 -1.387764
H  -1.181908 -0.72802 0.899404
H  4.563279 2.265638 -0.839127
H  4.851145 0.761279 -1.612834
H  -5.443317 0.714611 -1.077961
H  -4.474788 2.147502 -1.047014
H  3.862602 -2.519704 1.168707
H  -3.155339 -2.871985 -0.069084
