program: Gaussian 09
title: 000174716
version: EM64L-G09RevD.01
frameworkgroup: C1[X(C24H25N5O3S)]
method: RPBEPBE
basis: SDD
operation: Freq
keyword: #p
keyword: freq=noraman
keyword: PBEPBE/SDD
title: #p freq=noraman PBEPBE/SDD
converged: YES YES NO NO
title: Mulliken charges:
elementType: S O O O N N N N N C C C C C C C C C C C C C C C C C C C C C C C C H H H H H H H H H H H H H H H H H H H H H H H H H
charge: 0.977932 -0.312541 -0.537372 -0.544046 -0.490540 -0.172112 -0.249668 -0.492981 -0.387258 0.233227 0.272100 0.196919 -0.084627 0.267825 0.222094 -0.038520 0.180879 -0.397652 -0.385525 -0.292068 0.273254 -0.332398 -0.401166 -0.333487 -0.378237 -0.264291 -0.274582 -0.229102 0.143390 -0.639422 -0.641713 -0.764543 -0.631715 0.345602 0.229901 0.292153 0.271078 0.268322 0.232099 0.256722 0.291264 0.235112 0.235814 0.236264 0.268726 0.229715 0.258933 0.212909 0.231922 0.224815 0.252929 0.380807 0.264860 0.297839 0.275539 0.221628 0.221443 0.271554
chargesum: 0.00000
title: Mulliken charges with hydrogens summed into heavy atoms:
elementType: S O O O N N N N N C C C C C C C C C C C C C C C C C C C C C C C C
charge: 0.977932 -0.312541 -0.537372 -0.544046 -0.144938 -0.172112 -0.249668 -0.224255 -0.006451 0.233227 0.272100 0.196919 -0.084627 0.267825 0.222094 -0.038520 0.180879 -0.167751 -0.093372 -0.020991 0.273254 -0.064077 -0.169067 -0.076764 -0.086974 -0.029179 -0.038767 0.007162 0.143390 0.062134 0.067952 0.073694 0.082909
polarizability: 7.19059088e+02 -1.50479764e+01 3.98652723e+02 -1.88147246e+01 -5.04778285e+00 2.55034430e+02
1716.lowfreq: -8.5365 -4.2014 -0.0011 0.0009 0.0010 3.8691 5.4217 13.7429 23.4610
frequency: -6.4094 13.7269 23.4182 27.5545 37.4387 48.7374 59.7360 64.5153 78.3154 81.3912 88.8437 108.5616 113.5914 122.6804 130.0811 133.0008 147.7115 150.4870 161.9108 177.4058 186.8478 204.1246 206.6844 226.5766 240.7082 244.0847 262.6476 271.7558 294.3137 310.0276 322.1592 325.9440 331.5818 343.7952 356.4220 358.6080 368.4829 393.1795 398.1016 424.4727 435.7404 478.9094 486.1070 495.2612 501.1993 514.8071 518.2862 537.3499 542.7014 568.7598 582.0780 606.7313 627.8842 635.6719 662.0218 684.0213 693.6758 707.5812 721.3600 733.0241 755.4830 766.7544 773.1174 779.1713 787.5318 804.7406 811.7864 820.2730 834.7895 836.9606 865.5675 873.2628 880.3869 883.3416 894.5046 899.2893 935.5191 940.7867 946.9190 950.4898 960.0602 968.9818 977.6886 994.6746 1004.4995 1005.2327 1021.8384 1032.6295 1040.2348 1076.1441 1085.6016 1087.3701 1106.1672 1117.6283 1138.6651 1142.3004 1151.1152 1159.5690 1173.6829 1179.9998 1184.4649 1186.4548 1205.4371 1215.4441 1248.2949 1255.8067 1268.5795 1277.2881 1281.9284 1293.5156 1304.9604 1323.3753 1346.9177 1353.8364 1388.6371 1400.2854 1409.0256 1410.4782 1416.3575 1418.9113 1425.8730 1431.6645 1435.7858 1447.2381 1451.8388 1459.0220 1462.1155 1469.1391 1474.0610 1477.7082 1480.7987 1487.1323 1498.0236 1508.2068 1526.2912 1545.4307 1557.9616 1565.1870 1569.2286 1586.4207 1600.7920 1613.8943 1630.1511 2928.5746 2934.6344 2968.9123 3028.1302 3043.1371 3043.3323 3043.7612 3098.6193 3100.7775 3107.2592 3124.0712 3126.9408 3129.6589 3135.9441 3147.4543 3148.7802 3163.3840 3163.8540 3165.7148 3174.2311 3178.2363 3182.5550 3182.7258 3342.6508 3354.2474
redmass: 6.2431 7.3954 4.8023 4.7798 4.5746 5.4697 4.6868 4.2159 2.7610 1.1801 4.4004 4.7444 4.8392 4.5219 3.9350 4.3223 4.0016 1.4727 2.7134 3.3463 3.3642 1.3518 4.0049 1.8341 1.7996 4.1422 5.1582 3.4914 5.4119 5.6992 5.8785 4.9849 4.7980 3.8839 5.0609 5.0752 7.3150 4.4675 4.0018 4.8653 4.5900 3.4941 4.3884 4.3446 5.2388 4.3716 3.6924 7.6741 6.9536 5.0262 3.9341 6.5250 5.7848 4.1908 6.0143 4.8387 5.9002 5.6615 3.8275 3.6217 2.6229 1.4653 1.6380 2.0556 3.9903 7.1952 1.4548 4.0435 3.2853 1.5645 2.9370 2.0405 4.0561 1.9353 1.8323 4.8494 1.0871 1.3242 1.3232 1.4333 4.4423 1.3456 2.6140 1.3246 2.2864 1.3713 2.7507 3.0167 1.6393 2.4193 1.5651 1.7173 2.2464 1.3062 1.6120 1.7009 1.4584 1.3539 1.7963 2.6359 1.1901 1.1912 1.5862 2.2808 3.1133 2.2252 1.6493 2.5776 1.1372 5.6937 1.6577 3.7379 2.6294 2.6589 4.3089 3.8796 1.0597 1.2558 1.0608 2.6654 1.1816 3.5069 2.0771 2.0357 2.8061 1.5021 1.1844 1.0881 1.5471 1.1460 1.4235 1.0460 1.1783 3.3786 5.9453 5.9566 6.0270 4.2921 2.0660 3.9646 6.2461 6.1063 5.7895 1.0487 1.0471 1.0352 1.0239 1.1012 1.0842 1.0863 1.1006 1.0991 1.1011 1.0895 1.0864 1.0865 1.0857 1.0912 1.0889 1.0955 1.0982 1.0946 1.0998 1.1072 1.1055 1.0947 1.0753 1.0735
irintensity: 4.3653 2.5840 0.1428 0.7762 1.3239 1.0279 0.6691 3.4114 1.0252 1.6313 5.3990 8.1814 13.5322 22.2807 39.3923 16.7851 2.1523 0.1207 9.9637 27.9655 2.3795 14.4254 1.1551 10.9001 7.9537 2.3065 1.7083 2.7960 2.2203 9.8710 7.7449 27.9041 14.1427 4.2266 27.2050 6.8108 16.7200 4.2710 16.0970 10.1151 2.6248 63.6955 4.8665 9.4021 4.1900 5.2204 4.3792 21.8085 27.2908 10.6829 3.5440 11.5566 8.2937 4.8978 13.8465 47.8068 2.8263 10.7396 19.8181 72.9142 85.0198 13.1253 150.2679 19.5569 28.8533 71.4208 14.0198 8.1153 13.0259 133.7942 8.9801 4.5724 7.7001 25.3572 7.1820 8.8765 91.3250 6.8545 158.3242 1.7650 4.9776 4.2822 51.2188 1.0241 56.2938 1.6751 7.6387 13.6568 19.4197 4.5071 22.0400 8.2369 35.7493 0.2228 7.6476 28.6796 3.4440 3.9659 9.9958 43.5433 2.1815 6.6458 16.3597 15.0892 16.4954 15.5418 9.7524 67.1576 10.7912 37.1259 13.1611 60.9181 54.5357 83.2221 73.8282 13.7729 5.4121 9.6540 9.8696 19.6404 5.3627 104.8763 14.9764 84.0381 4.9201 80.8601 1.2071 83.8228 39.1255 42.6165 180.0676 15.0038 124.8047 611.1182 131.6414 101.7518 303.3527 44.9352 186.7126 52.2407 148.9455 127.4219 58.0726 48.4871 144.2067 121.9488 0.8071 38.0412 38.2104 9.5248 14.0183 64.1382 22.7917 20.9728 742.1112 65.6187 9.6957 6.1092 3.0676 18.7171 19.7322 1.0391 23.8236 0.1518 0.6733 1.0344 14.4758 115.0293
temp: 298.150 k
press: 1.00000 atm
elementType: 16 8 8 8 7 7 7 7 7 6 6 6 6 6 6 6 6 6 6 6 6 6 6 6 6 6 6 6 6 6 6 6 6 1 1 1 1 1 1 1 1 1 1 1 1 1 1 1 1 1 1 1 1 1 1 1 1 1
symmnumber: 1
zpe: 1178017.3 jmol-1
zpe.correction: 0.448683 hartree
zpe.thermalcorrener: 0.479992 hartree
zpe.thermalcorrenthalpy: 0.480936 hartree
zpe.thermalcorrgfe: 0.384655 hartree
zpe.sumelectzpe: -1824.541844 hartree
zpe.sumelectthermal: -1824.510535 hartree
zpe.sumelectthermalent: -1824.509591 hartree
zpe.sumelectthermalfe: -1824.605872 hartree
dipole: -0.1868 3.5575 0.5717
dipole: 3.6080
quadrupole: -296.2772 -189.9077 -183.4135
quadrupole: -25.9033 -7.6276 -6.6072
quadrupole: -73.0777 33.2918 39.7860 -25.9033 -7.6276 -6.6072
hfenergy: -1824.9905269 hartree
pointgroup: C01 [X(C24H25N5O3S1)]
dipole: 0.1805746 1.204782 0.7285955 debye
polarizability: 719.7812522|2.2849188|331.9297144|-16.9770228|71.8033549|321.035275 unknown
InChI: InChI=1S/C24H25N5O3S/c1-25-24(30)18-10-7-9-17-22(16-8-5-6-11-19(16)26-23(17)18)27-20-13-12-15(28-33(4,31)32)14-21(20)29(2)3/h5-14,25,27-28H,1-4H3
charge 0 multiplicity 1
58 atoms
S  -6.655677 -0.987962 0.973183
O  6.152083 -3.114552 -1.153926
O  -8.075606 -0.83493 1.749985
O  -6.571744 -1.089401 -0.650921
N  -0.36066 0.33265 -0.814164
N  3.662347 -0.072839 0.573223
N  -2.492006 0.825067 -2.408207
N  -5.515501 0.657898 1.479291
N  6.022911 -1.323285 0.343942
C  0.942401 0.204902 -0.304242
C  1.77247 -0.851004 -0.819251
C  1.490326 1.134092 0.642226
C  3.159292 -0.93706 -0.368149
C  -1.583728 0.506155 -0.146305
C  -2.731417 0.723983 -0.99266
C  2.865227 0.922635 1.072168
C  4.016167 -1.975241 -0.920088
C  1.271628 -1.833161 -1.739392
C  -4.013754 0.759169 -0.420968
C  -1.761407 0.354203 1.25488
C  -4.195774 0.583121 0.983078
C  0.791402 2.292416 1.129846
C  -3.051366 0.36799 1.810042
C  3.441331 1.822054 2.036137
C  3.479592 -2.878149 -1.843363
C  2.111594 -2.823557 -2.243639
C  1.38823 3.158366 2.043084
C  2.720337 2.910398 2.517184
C  5.487821 -2.18303 -0.583802
C  -3.594178 0.380867 -3.292957
C  -1.891772 2.113222 -2.86123
C  -5.786112 -2.580603 1.645666
C  7.423585 -1.403879 0.756775
H  -0.521107 0.093361 -1.806315
H  0.214172 -1.828699 -2.025688
H  -4.900564 0.929933 -1.036086
H  -0.894194 0.17229 1.895794
H  -0.221118 2.501597 0.774769
H  -3.178782 0.215652 2.889235
H  4.468352 1.624848 2.358841
H  4.158149 -3.643478 -2.235584
H  1.721511 -3.573461 -2.939552
H  0.842027 4.03851 2.398396
H  3.171985 3.592032 3.245988
H  -5.570554 0.643521 2.518333
H  -3.1916 0.222009 -4.308962
H  -4.014142 -0.568783 -2.924498
H  -4.421043 1.122203 -3.364007
H  -1.507468 1.997941 -3.89013
H  -2.639049 2.936826 -2.854253
H  -1.053313 2.39996 -2.20573
H  5.35656 -0.614146 0.724637
H  -5.881759 -2.552007 2.739686
H  -6.340536 -3.417775 1.199114
H  -4.743788 -2.540061 1.30031
H  7.509753 -1.615092 1.839848
H  7.957125 -0.458648 0.540892
H  7.903639 -2.221666 0.195214
