program: Gaussian 09
title: 000174684
version: EM64L-G09RevD.01
frameworkgroup: C1[X(C21H25N3O8S)]
method: RPBEPBE
basis: SDD
operation: Freq
keyword: #p
keyword: freq=noraman
keyword: PBEPBE/SDD
title: #p freq=noraman PBEPBE/SDD
converged: YES YES NO NO
title: Mulliken charges:
elementType: S O O O O O O O O N N N C C C C C C C C C C C C C C C C C C C C C H H H H H H H H H H H H H H H H H H H H H H H H H
charge: 0.183401 -0.281874 -0.518312 -0.409036 -0.255793 -0.414196 -0.243572 -0.449305 -0.244630 -0.403762 -0.624102 -0.344030 -0.217609 -0.236123 -0.650493 -0.391245 0.273036 -0.671466 0.407580 0.294930 0.203717 0.352990 0.202494 -0.521408 -0.142034 -0.797975 -0.401572 -0.382586 -0.235228 -0.262162 0.185936 -0.452087 0.221856 0.297140 0.252376 0.267523 0.343558 0.249821 0.203268 0.357529 0.291811 0.257491 0.279596 0.284440 0.245520 0.254366 0.250750 0.282246 0.196169 0.328450 0.235617 0.232449 0.260253 0.282675 0.408921 0.357191 0.374016 0.431485
chargesum: 0.00000
title: Mulliken charges with hydrogens summed into heavy atoms:
elementType: S O O O O O O O O N N N C C C C C C C C C C C C C C C C C C C C C
charge: 0.183401 -0.281874 -0.109390 -0.051845 -0.255793 -0.040180 -0.243572 -0.017820 -0.244630 -0.046233 -0.060066 -0.015580 0.079531 0.016254 -0.039412 0.061844 0.273036 -0.671466 0.407580 0.294930 0.203717 0.352990 0.202494 0.027894 -0.142034 -0.047338 -0.119326 -0.186418 0.000389 -0.029713 0.185936 0.090840 0.221856
polarizability: 4.12196220e+02 1.25527958e+01 3.03136905e+02 1.63019857e+01 1.33718810e+01 1.98999674e+02
1716.lowfreq: -14.3215 -7.4872 -5.0550 -0.0015 0.0013 0.0019 8.7528 12.8823 22.8887
frequency: -7.4874 11.9109 22.8523 25.3888 30.1520 31.7302 35.9501 49.9026 60.9043 70.8308 80.3440 84.4378 89.3448 93.3606 98.9139 110.5808 114.0391 134.8765 149.2722 167.5480 170.2790 195.5172 210.4097 220.5635 229.9119 236.3725 255.0122 257.4438 281.1986 284.8790 296.7528 304.0071 309.0030 322.3500 329.2665 343.4881 356.6132 369.5598 379.2180 395.8148 405.1940 430.9772 447.0542 468.2536 479.3713 495.1647 509.3338 523.4807 537.6492 543.5703 555.2876 555.4028 584.6069 591.5046 599.0383 624.4363 635.3989 636.7577 637.7311 644.2867 648.5937 666.0778 684.4242 689.5954 697.5891 737.9571 765.6921 766.6349 772.2431 793.8017 810.2426 816.3209 825.6036 835.7807 855.5477 883.2550 898.0155 902.9516 923.2630 946.4304 957.5325 971.7008 984.8338 996.6098 1007.6813 1010.0380 1013.7550 1030.3983 1035.8433 1037.7023 1040.5839 1043.5577 1069.8997 1087.3965 1103.8904 1116.2097 1136.3026 1150.4821 1157.4604 1173.5464 1175.9727 1176.7104 1184.5923 1214.2161 1218.9683 1223.2381 1228.4497 1246.2577 1248.3304 1260.0495 1266.8746 1294.5455 1302.3097 1305.6136 1315.3788 1324.5394 1357.4509 1359.1645 1362.8960 1383.5298 1385.9700 1401.1398 1405.0236 1418.5698 1428.2280 1441.1655 1441.4533 1443.2341 1444.2994 1447.7679 1465.1984 1466.6544 1470.0320 1498.2007 1508.0616 1574.1488 1591.9604 1598.7555 1628.9834 1630.5416 1632.3254 1659.9734 1660.7239 2896.2524 2973.8574 2985.1174 3004.5275 3006.7417 3011.0437 3037.0637 3050.4462 3056.2845 3065.5931 3082.8437 3097.8347 3107.4746 3123.3307 3139.8661 3140.6000 3159.3878 3178.0360 3420.8780 3453.4487 3454.2205 3509.5496 3534.0838 3585.6348 3586.9754
redmass: 6.0914 6.6220 6.1872 7.2090 7.3375 9.4546 8.2476 6.3776 6.4830 5.4263 3.5894 1.4241 5.5092 7.6275 5.4549 3.8655 3.1965 4.2148 4.5166 3.9538 4.6164 2.0652 2.3900 5.6614 3.4850 4.1466 1.6174 3.8744 4.1050 3.2385 3.4932 4.3704 4.5190 3.3374 3.7388 4.0492 5.3692 6.8028 3.4786 5.3581 2.8357 6.1007 3.1993 4.6450 6.7562 1.9829 3.1187 2.6075 3.7756 2.9383 3.6423 2.0583 2.7579 2.3578 2.7168 3.1535 2.6421 5.3866 4.9885 1.4210 2.9745 1.9722 1.4431 2.8084 5.2824 4.5154 3.8638 1.7103 4.5504 3.5562 2.2211 5.2458 4.0267 2.8933 2.9194 2.1919 1.2944 1.7789 3.7424 4.7834 1.3775 2.4744 2.1897 1.3382 1.9175 1.7791 2.1721 3.5922 2.2351 2.9487 1.6811 3.4756 2.8698 3.8322 1.9456 1.8005 1.5423 1.3929 1.8560 1.2568 1.2496 1.4334 1.4006 1.6865 1.5416 1.5846 1.8240 1.4984 1.4803 1.4689 1.8078 1.5198 1.3835 2.6632 1.2986 1.4069 4.5421 1.9986 1.4897 1.6480 2.7604 1.2655 2.9278 1.6513 4.4243 1.0919 1.0939 1.0911 1.3838 2.0866 1.1987 1.9403 1.2045 1.8118 3.1080 8.0655 6.4346 8.1965 5.9934 6.7121 1.1081 5.4767 7.6576 1.0814 1.0822 1.0407 1.0619 1.0647 1.0671 1.0594 1.0624 1.0961 1.0923 1.0994 1.0879 1.1003 1.1062 1.0883 1.1033 1.0947 1.0977 1.0658 1.0449 1.0776 1.0639 1.0768 1.0987 1.0655
irintensity: 0.0545 0.0720 0.1812 0.6952 1.2420 2.3945 1.7406 0.9624 1.3524 6.4966 3.5965 2.5144 10.3747 2.7092 0.5213 5.8508 4.8671 8.8708 17.4234 4.1574 10.5132 31.5980 26.6469 13.0160 27.9582 22.4054 73.1061 7.7875 7.7700 16.7659 30.8733 19.0268 5.0647 5.7939 9.4578 19.7488 3.8656 4.6509 5.4930 19.7233 13.6280 0.2117 14.9996 3.5742 8.5585 47.9714 102.0663 51.6387 9.3672 11.3282 25.7815 96.8216 174.6997 25.1545 5.6060 43.2577 12.3837 31.2326 12.9787 137.9214 24.3423 148.5469 36.0554 9.5598 11.2532 5.3376 57.6566 121.1870 22.0499 14.4688 3.1403 8.9189 9.0537 45.9340 29.4781 5.3309 295.1060 25.2009 11.1806 3.9831 2.3687 6.5684 15.5385 1.4600 21.8531 30.7253 12.5485 30.8951 72.4835 193.1831 35.9342 44.1928 74.7014 34.6859 2.7357 14.0504 171.7365 21.5184 79.3908 23.6531 30.1718 11.8458 84.3185 28.4124 79.2371 23.6607 8.5322 80.6106 0.2493 7.2657 29.3378 34.8150 7.3521 2.3859 13.9455 22.8853 141.7136 45.5435 23.1384 39.6722 1.6120 11.7149 15.8917 24.0698 10.2367 20.1221 6.6085 59.7652 19.9389 7.8617 79.3078 430.7649 25.0926 82.1702 26.0860 7.3386 21.1302 131.5497 72.8773 26.4050 48.4801 135.3161 262.5301 46.5202 10.7036 8.6336 18.3725 24.9297 881.4824 17.1983 27.9993 6.5661 10.3520 10.4786 15.1594 3.4424 2.7578 11.0383 0.4319 20.4985 15.4212 190.7306 3.4318 102.5888 22.5431 22.2294 2.4429 22.7495
temp: 298.150 k
press: 1.00000 atm
elementType: 16 8 8 8 8 8 8 8 8 7 7 7 6 6 6 6 6 6 6 6 6 6 6 6 6 6 6 6 6 6 6 6 6 1 1 1 1 1 1 1 1 1 1 1 1 1 1 1 1 1 1 1 1 1 1 1 1 1
symmnumber: 1
zpe: 1165835.9 jmol-1
zpe.correction: 0.444043 hartree
zpe.thermalcorrener: 0.477209 hartree
zpe.thermalcorrenthalpy: 0.478153 hartree
zpe.thermalcorrgfe: 0.376128 hartree
zpe.sumelectzpe: -1976.938989 hartree
zpe.sumelectthermal: -1976.905824 hartree
zpe.sumelectthermalent: -1976.904880 hartree
zpe.sumelectthermalfe: -1977.006905 hartree
dipole: -2.9046 -0.6783 -2.7226
dipole: 4.0385
quadrupole: -175.4331 -191.3729 -206.2903
quadrupole: 12.8794 4.0105 -14.3511
quadrupole: 15.5990 -0.3408 -15.2582 12.8794 4.0105 -14.3511
hfenergy: -1977.3830329 hartree
pointgroup: C01 [X(C21H25N3O8S1)]
dipole: 1.1634386 0.0501916 -1.0809078 debye
polarizability: 413.3231337|-4.3277314|300.56322|-18.9993796|-15.6587899|200.4464444 unknown
InChI: InChI=1S/C21H25N3O8S/c1-10-17(29)11-4-2-3-5-12(11)18(30)19(10)33-9-14(21(32)23-8-16(27)28)24-20(31)13(22)6-7-15(25)26/h2-5,13-14,23-25,27,29-30H,6-9,22H2,1H3
charge 0 multiplicity 1
58 atoms
S  0.368186 -0.418923 0.957548
O  -2.805544 1.459466 -1.438228
O  3.074069 -1.883302 0.767658
O  3.391179 3.616168 -0.485616
O  -2.327743 -2.816608 0.907326
O  -7.921228 1.608474 -1.272409
O  -7.200094 1.627287 0.930837
O  1.779941 -3.628279 -0.749862
O  1.338233 -4.076824 1.490307
N  -2.750243 -0.33387 0.027342
N  -2.984892 2.111298 1.789688
N  -0.985023 -3.429893 -0.90406
C  -1.806288 -1.10337 -0.779277
C  -3.961106 1.672339 0.760298
C  -0.396158 -0.453304 -0.800341
C  -4.671635 2.913174 0.182846
C  -3.145347 0.940202 -0.328387
C  1.991014 0.335657 0.500081
C  2.091089 1.739245 0.198586
C  4.408793 0.014465 0.094483
C  -1.752635 -2.533126 -0.185997
C  4.520659 1.409017 -0.269658
C  3.125122 -0.494038 0.473238
C  -5.76309 2.591121 -0.853902
C  3.348881 2.241238 -0.180582
C  0.909294 2.681838 0.271979
C  5.571742 -0.821499 0.056951
C  5.799977 1.901789 -0.692135
C  6.804959 -0.306803 -0.346413
C  6.918148 1.065516 -0.731126
C  -6.983468 1.907588 -0.270607
C  -0.363028 -4.594539 -0.246176
C  0.999209 -4.125095 0.284011
H  -2.153512 -1.129551 -1.833351
H  -4.733206 0.973509 1.161942
H  0.301928 -1.007541 -1.449606
H  -0.485677 0.586535 -1.147655
H  -3.902042 3.545442 -0.292153
H  -5.114521 3.481827 1.023112
H  -3.086664 -0.805738 0.87702
H  -5.35547 1.966672 -1.670364
H  -6.113267 3.519301 -1.345488
H  -3.39695 2.704192 2.516787
H  -2.391096 1.368775 2.172659
H  0.5242 2.923455 -0.737429
H  0.079311 2.256894 0.858606
H  1.216131 3.642073 0.719742
H  5.468075 -1.867348 0.357623
H  5.924251 2.945754 -1.010114
H  -0.511821 -3.098658 -1.748728
H  7.689255 -0.952043 -0.370695
H  7.885378 1.460328 -1.059442
H  -0.245359 -5.423367 -0.963073
H  -0.992977 -4.908187 0.59818
H  2.368829 -2.108517 1.438737
H  4.320878 3.931607 -0.601201
H  -8.71222 1.169092 -0.856101
H  2.539472 -3.058718 -0.36721
