program: Gaussian 09
title: 000174592
version: EM64L-G09RevD.01
frameworkgroup: C1[X(C13H10Cl3O2PS)]
method: RPBEPBE
basis: SDD
operation: Freq
keyword: #p
keyword: freq=noraman
keyword: PBEPBE/SDD
title: #p freq=noraman PBEPBE/SDD
converged: NO YES NO NO
title: Mulliken charges:
elementType: Cl Cl Cl S P O O C C C C C C C C C C C C C H H H H H H H H H H
charge: 0.031785 0.032724 0.001259 -0.196919 0.640469 -0.475316 -0.470960 0.017251 0.497319 -0.255074 -0.312538 -0.212656 -0.205677 -0.286398 -0.301221 -0.216845 -0.033597 -0.195849 -0.119216 -0.473581 0.276598 0.277645 0.271775 0.239456 0.239381 0.237606 0.263413 0.245212 0.237944 0.246009
chargesum: 0.00000
title: Mulliken charges with hydrogens summed into heavy atoms:
elementType: Cl Cl Cl S P O O C C C C C C C C C C C C C
charge: 0.031785 0.032724 0.001259 -0.196919 0.640469 -0.475316 -0.470960 0.017251 0.497319 0.021525 -0.034893 0.026800 0.033704 -0.286398 -0.029446 0.020761 -0.033597 0.067564 -0.119216 0.255583
polarizability: 2.56741460e+02 2.29459875e+01 2.40690571e+02 -1.99886387e+01 -1.23746959e+01 1.63768864e+02
1716.lowfreq: -7.2224 -0.0023 -0.0018 -0.0012 3.8047 6.9373 9.0105 14.6676 32.0278
frequency: 7.5681 12.2563 31.8719 42.9431 71.2598 75.3606 81.9660 102.5298 116.8561 129.4686 146.9461 163.9207 191.8216 202.5792 227.7369 228.0325 249.6074 278.1691 295.6225 297.7992 328.0491 338.9419 393.8756 399.3246 436.4306 468.3634 475.0667 504.5674 520.2423 526.5686 569.8488 592.1154 608.7271 680.0812 689.8771 692.9045 706.5493 718.5118 737.6678 762.6514 804.9045 855.8943 882.8165 930.2785 936.0064 972.5934 983.5215 986.1549 1005.5887 1020.1690 1036.8465 1081.9132 1088.7378 1115.9474 1135.3241 1143.1308 1161.3098 1177.2517 1191.5632 1229.3446 1314.4118 1341.6790 1360.6846 1383.9137 1421.6178 1423.3944 1429.3995 1457.8206 1464.8821 1474.3946 1549.9708 1570.5452 1587.3755 1593.8858 2984.6910 3088.6077 3132.8491 3134.0235 3140.8135 3153.6381 3166.8821 3169.7038 3177.6595 3188.8262
redmass: 8.0045 5.4743 5.4308 12.5678 8.1221 4.0301 12.6060 5.3006 8.5598 1.0613 6.4671 6.8035 16.8674 29.9369 7.7461 6.5148 7.4125 7.7833 8.0331 6.8421 24.4295 8.0935 2.8076 10.0210 9.0757 9.5568 4.0469 4.6145 9.5498 7.2811 10.3658 5.8166 6.5148 10.1058 5.3795 2.5775 7.5279 5.8826 9.6223 1.5708 1.4798 1.2479 8.7749 1.3496 1.3654 10.8640 1.4063 6.0286 1.3300 2.9781 8.2345 1.6437 2.6768 1.2473 1.3062 1.5474 2.1133 1.0552 1.1274 3.3765 1.3065 6.1929 6.5458 9.0186 1.7098 1.5179 2.1187 1.0499 2.0266 1.0513 8.3861 7.4489 6.0500 5.8772 1.0301 1.1046 1.1031 1.0863 1.0895 1.0928 1.0973 1.0889 1.0998 1.0975
irintensity: 0.4985 0.1213 0.4998 0.5023 0.0498 3.7841 0.8611 0.7578 1.3217 0.3564 7.7677 1.2389 0.7294 0.1295 1.8803 5.1390 5.2438 4.5891 3.8340 6.4252 1.2434 19.2337 0.2383 1.4266 28.3196 8.1952 5.6223 0.8938 88.8082 7.5543 86.4781 34.2827 3.2863 71.9554 55.3186 102.2654 26.3602 1.8486 81.1620 27.4136 48.3810 0.1861 115.1891 0.3470 0.3163 183.9395 0.4736 5.1770 0.1328 1.5329 29.5774 7.0144 36.1142 0.0013 0.1543 2.1354 25.9713 0.0628 7.5009 125.0357 4.6725 11.7570 30.5130 1.2355 129.5152 113.2153 24.6856 16.4507 7.8349 18.5334 0.8599 14.4182 0.4645 0.5994 45.3551 22.2986 15.1887 0.4889 1.8808 11.2057 18.4759 1.1333 13.6401 0.3064
temp: 298.150 k
press: 1.00000 atm
elementType: 17 17 17 16 15 8 8 6 6 6 6 6 6 6 6 6 6 6 6 6 1 1 1 1 1 1 1 1 1 1
symmnumber: 1
zpe: 517717.7 jmol-1
zpe.correction: 0.197188 hartree
zpe.thermalcorrener: 0.218097 hartree
zpe.thermalcorrenthalpy: 0.219041 hartree
zpe.thermalcorrgfe: 0.142578 hartree
zpe.sumelectzpe: -2769.844938 hartree
zpe.sumelectthermal: -2769.824029 hartree
zpe.sumelectthermalent: -2769.823085 hartree
zpe.sumelectthermalfe: -2769.899548 hartree
dipole: 3.0667 -0.3315 -0.8789
dipole: 3.2073
quadrupole: -152.7888 -136.4588 -148.0789
quadrupole: 13.4897 -3.1102 9.3131
quadrupole: -7.0133 9.3167 -2.3034 13.4897 -3.1102 9.3131
hfenergy: -2770.042126 hartree
pointgroup: C01 [X(C13H10Cl3O2P1S1)]
dipole: -1.1629624 -0.3132239 0.3764235 debye
polarizability: 243.9470597|4.555478|188.2788243|-34.9960759|38.3872935|228.9750109 unknown
InChI: InChI=1S/C13H10Cl3O2PS/c1-17-19(20,9-5-3-2-4-6-9)18-11-8-7-10(14)12(15)13(11)16/h2-8H,1H3
charge 0 multiplicity 1
30 atoms
Cl 1.144648 0.835874 1.940976
Cl 4.127293 1.544641 0.880361
Cl 5.100582 0.3865 -2.002816
S  -1.955559 -0.134631 -2.612889
P  -1.963207 -0.427138 -0.570466
O  -0.374605 -0.988418 0.109952
O  -2.874912 -1.742408 0.075577
C  -2.521268 0.943189 0.520566
C  0.864026 -0.615617 -0.416773
C  -2.739113 0.695461 1.897152
C  -2.709517 2.228195 -0.036525
C  -3.156209 1.760094 2.723758
C  -3.123378 3.285987 0.802574
C  1.727487 0.207681 0.356052
C  1.307309 -1.110783 -1.66561
C  -3.345364 3.053064 2.179638
C  3.026594 0.518347 -0.110434
C  2.594297 -0.792599 -2.138722
C  3.448917 0.014527 -1.363285
C  -2.70635 -3.077144 -0.540725
H  -2.591288 -0.307943 2.306261
H  -2.541526 2.390675 -1.107332
H  0.634518 -1.736135 -2.257367
H  -3.330665 1.581773 3.789932
H  -3.271906 4.285875 0.381978
H  -3.665721 3.876242 2.827683
H  2.940035 -1.17009 -3.104461
H  -1.708528 -3.483638 -0.301039
H  -2.848654 -3.019736 -1.635726
H  -3.493639 -3.695844 -0.08599
