program: Gaussian 09
title: 000174201
version: EM64L-G09RevD.01
frameworkgroup: C1[X(C12H8O5)]
method: RPBEPBE
basis: SDD
operation: Freq
keyword: #pfreq=noraman
keyword: PBEPBE/SDD
title: #p freq=noraman PBEPBE/SDD
converged: YES YES NO NO
title: Mulliken charges:
elementType: O O O O O C C C C C C C C C C C C H H H H H H H H
charge: -0.338777 -0.441946 -0.461773 -0.355445 -0.199946 0.283503 0.468409 -0.011541 -0.562101 0.169796 -0.046207 -0.363599 -0.445703 -0.234826 -0.251270 0.178522 0.100901 0.296862 0.312198 0.253149 0.232153 0.237265 0.397237 0.397080 0.386062
chargesum: 0.00000
title: Mulliken charges with hydrogens summed into heavy atoms:
elementType: O O O O O C C C C C C C C C C C C
charge: 0.058460 -0.044866 -0.075712 -0.355445 -0.199946 0.283503 0.468409 -0.011541 -0.265239 0.169796 -0.046207 -0.051401 -0.192554 -0.002673 -0.014005 0.178522 0.100901
polarizability: 2.29154994e+02 1.66202276e+01 1.94446734e+02 1.80507162e-01 5.80518506e-01 5.68232335e+01
1716.lowfreq: -8.0914 -1.7896 -0.0009 -0.0009 -0.0007 4.4761 14.8367 53.2265 75.1764
frequency: 14.6938 53.2039 75.1714 114.2137 141.7825 166.6037 234.9600 261.0353 310.5770 318.8682 342.8604 356.8101 407.1739 419.5075 422.7406 458.3815 489.0524 548.0375 561.9617 575.6520 605.5587 607.4610 634.6095 655.4939 665.9325 712.3823 725.7210 762.4426 779.0635 818.1790 829.6533 861.2534 893.1426 949.0616 962.1978 963.1198 986.8760 991.6387 1007.3058 1041.6692 1081.2162 1109.2288 1167.6863 1182.8754 1227.1999 1250.6923 1259.6030 1300.4770 1313.1737 1342.1581 1389.5016 1403.4164 1424.8885 1439.0971 1448.9407 1500.1144 1564.0359 1593.9437 1611.4449 1627.6759 1663.2265 2721.1411 3128.8562 3139.5931 3165.3897 3167.7947 3214.6726 3503.1362 3535.5786
redmass: 12.5402 7.6296 4.5587 7.2164 7.5792 7.9503 6.6152 4.9267 5.3561 9.1551 6.0195 10.1299 6.3329 5.4590 4.7123 10.0873 2.6137 3.4057 5.1520 1.2611 1.7278 2.7151 5.4601 5.2217 5.0848 6.3129 6.0113 2.6943 1.7532 3.4512 8.2133 5.3283 1.5203 1.0659 1.7537 3.9636 5.6018 1.6428 1.3459 2.1974 2.3340 2.0841 1.3343 1.1705 1.9346 1.9178 1.9944 3.1884 2.3734 3.7969 4.7730 3.6461 3.4877 3.0782 2.5979 3.2073 7.2924 6.4772 2.5615 6.3196 9.0119 1.0742 1.0873 1.0912 1.0986 1.0925 1.0930 1.0635 1.0642
irintensity: 0.6153 0.7373 0.0706 0.8192 0.1661 1.0049 0.1816 0.8968 2.7784 0.4142 1.1778 2.6198 6.9180 3.4277 0.8283 2.5728 3.3218 0.0676 99.3828 202.3168 49.8501 57.9049 1.6786 3.8796 59.5013 24.5925 0.7250 2.1461 90.9526 17.5522 18.8843 8.6492 7.7495 138.7263 24.2015 57.3417 54.9252 19.4947 1.1899 9.0042 682.9233 22.7695 8.7434 3.9486 50.6156 46.0238 76.9740 2.8045 50.1248 39.9630 71.7347 110.3761 22.3612 42.2166 102.4305 12.3576 85.5484 28.4842 162.3441 121.0322 455.5920 359.0624 0.8057 15.5734 25.5042 2.1293 7.1851 72.4819 48.2519
temp: 298.150 k
press: 1.00000 atm
elementType: 8 8 8 8 8 6 6 6 6 6 6 6 6 6 6 6 6 1 1 1 1 1 1 1 1
symmnumber: 1
zpe: 461775.3 jmol-1
zpe.correction: 0.175881 hartree
zpe.thermalcorrener: 0.189490 hartree
zpe.thermalcorrenthalpy: 0.190434 hartree
zpe.thermalcorrgfe: 0.134044 hartree
zpe.sumelectzpe: -837.047478 hartree
zpe.sumelectthermal: -837.033869 hartree
zpe.sumelectthermalent: -837.032925 hartree
zpe.sumelectthermalfe: -837.089315 hartree
dipole: -4.1304 -2.3712 -0.0948
dipole: 4.7636
quadrupole: -91.6110 -85.3088 -99.7573
quadrupole: -13.4004 -0.7897 -0.4668
quadrupole: 0.6147 6.9169 -7.5316 -13.4004 -0.7897 -0.4668
hfenergy: -837.2233589 hartree
pointgroup: C01 [X(C12H8O5)]
dipole: 1.7038414 0.7796675 0.0376823 debye
dipolederiv: -0.7375599 -0.2595973 -0.0270679 -0.5578965 -0.9082993 -0.0278808 -0.0237251 -0.0156985 -0.3399661 -1.0422816 0.6540165 -0.0579847 0.3624273 -0.5319956 0.0273983 -0.0508056 0.0467352 -0.4080095 -0.5142815 0.2961251 -0.04967 0.5614549 -1.157871 0.1358415 -0.0966646 0.1189325 -0.4588513 -0.6926702 -0.279955 -0.0188511 -0.2022458 -1.3045378 0.0046826 -0.0189131 0.0010514 -0.3616016 -1.14931 -0.2230816 0.018669 -0.0625978 -0.5716083 0.0543225 -0.0131819 0.0502047 -0.3124282 0.3031465 0.5547707 0.0028433 -0.0717907 0.3358226 -0.0097203 0.0182971 0.0298945 0.0509982 -0.6192557 0.1823225 -0.0435622 0.14936 -0.1686322 0.0135409 -0.0432751 0.0134722 0.0307774 -0.5250147 0.1086588 -0.0329285 0.2368852 -1.0571278 0.0355753 -0.0378145 0.0254017 -0.0773063 0.8243075 0.0501541 0.0549467 0.29211 0.0917593 0.0125712 0.0245852 -0.0025232 -0.0775946 -0.9148762 0.0709907 -0.0472079 -0.3739521 -0.4254471 -0.0035866 -0.0329701 0.0245111 -0.02117 0.739699 0.0578307 0.0451984 0.4649975 0.8998449 0.0264604 0.0577147 -0.006115 0.1120304 -0.2351709 -0.3905285 0.0042667 -0.1542135 -0.1354335 -0.0110826 0.0000998 -0.023963 -0.1512519 0.2352815 -0.1781132 0.0287804 0.1661274 0.1002249 0.0020913 0.0215236 -0.0196124 -0.1538258 0.1633065 -0.0300336 0.0198833 -0.1072641 0.2422661 -0.0166888 0.0219314 -0.0126069 -0.1327735 -0.2215329 0.2252803 -0.0092769 0.218151 -0.0568776 0.0092255 -0.0109676 0.0110117 -0.1661739 1.2548009 -0.4316275 0.0800048 -0.2778948 2.1029456 -0.0545963 0.0712986 -0.068025 0.255164 2.0651457 -0.1855092 0.0599726 -0.4770492 1.3533748 -0.2176577 0.1107609 -0.1793375 0.2658581 0.1460144 -0.0226948 0.0018415 0.0407842 0.0179798 0.0042069 0.006025 0.0008973 0.1446783 0.0829447 0.0406247 -0.0059884 0.0713452 0.0871306 0.0073499 -0.0072759 0.005169 0.1671592 0.0559273 0.1020438 -0.0093461 0.0285004 -0.053841 0.0077364 -0.0062846 0.0123925 0.1547744 -0.123316 0.0167476 -0.0177135 0.0326345 0.0865283 0.0039477 -0.0180354 0.0027855 0.15161 -0.0006294 -0.1048278 -0.0072275 -0.1134084 -0.040819 -0.0008914 -0.0072438 -0.0002312 0.1662789 0.4431419 -0.0371457 0.0066495 -0.0090283 0.5447124 -0.0055615 0.0064045 -0.0053354 0.3650182 0.3294839 -0.1887255 -0.0005026 -0.0806047 0.2095814 -0.0017331 -0.002327 -0.0089788 0.3989235 0.1326992 -0.0277257 0.004271 -0.1368319 0.3403195 0.0044485 0.0308433 -0.0000323 0.397682 unknown
polarizability: 231.3808646|13.4164744|191.5773377|9.3631379|-3.6658583|57.466759 unknown
InChI: InChI=1S/C12H8O5/c13-10-8(11(14)15)5-6-3-1-2-4-7(6)9(10)12(16)17/h1-5,13-14,16H
charge 0 multiplicity 1
25 atoms
O  -2.08161 -1.805929 -0.080669
O  1.948488 -2.87866 0.21236
O  -3.271716 2.263495 -0.359576
O  -0.254992 -3.469675 0.074952
O  -4.060004 0.105521 -0.054946
C  1.226445 -0.000321 0.09756
C  0.716005 1.353874 0.026564
C  0.264907 -1.096511 0.064272
C  -0.689144 1.583079 -0.064302
C  -1.625682 0.548476 -0.087528
C  -1.150183 -0.817606 -0.030604
C  2.648334 -0.158155 0.190451
C  1.609554 2.473171 0.049013
C  3.499714 0.95512 0.210844
C  2.988761 2.284367 0.139949
C  0.611608 -2.517292 0.114258
C  -3.079133 0.871382 -0.157907
H  -1.057656 2.611699 -0.115484
H  3.071587 -1.15977 0.246261
H  1.184804 3.482158 -0.00695
H  4.581673 0.796683 0.2828
H  3.671441 3.139785 0.157085
H  -1.590406 -2.720559 -0.029717
H  1.991543 -3.873877 0.235345
H  -4.251439 2.431246 -0.384531
