program: Gaussian 09
title: 000174223
version: EM64L-G09RevD.01
frameworkgroup: C1[X(C14H12N2O3S2)]
method: RPBEPBE
basis: SDD
operation: Freq
keyword: #p
keyword: freq=noraman
keyword: PBEPBE/SDD
title: #p freq=noraman PBEPBE/SDD
converged: YES YES NO NO
title: Mulliken charges:
elementType: S S O O O N N C C C C C C C C C C C C C C H H H H H H H H H H H H
charge: 0.924199 0.316953 -0.558478 -0.512223 -0.486036 -0.031669 -0.681947 -0.187101 -0.360130 0.321880 0.484671 -0.385559 -0.370384 -0.394468 0.539597 -0.805047 -0.381804 -0.347845 -0.409037 -0.421808 0.503764 0.265536 0.245871 0.280438 0.259129 0.228596 0.272563 0.231087 0.223486 0.223091 0.384962 0.313713 0.314003
chargesum: 0.00000
title: Mulliken charges with hydrogens summed into heavy atoms:
elementType: S S O O O N N C C C C C C C C C C C C C C
charge: 0.924199 0.316953 -0.173517 -0.512223 -0.486036 -0.031669 -0.054231 -0.187101 -0.360130 0.321880 0.484671 -0.385559 -0.104848 -0.148597 0.539597 -0.036885 -0.109241 -0.116758 -0.185551 -0.198717 0.503764
polarizability: 4.68319492e+02 -3.45913261e+01 2.28999784e+02 -2.02016942e-01 -1.73521270e+00 1.03878810e+02
1716.lowfreq: -6.5212 -2.1123 0.0007 0.0019 0.0020 3.5607 17.0730 37.1317 44.6540
frequency: 16.7753 37.0457 44.6030 62.3607 74.3103 90.6085 106.0279 134.9743 150.7249 158.3664 180.8801 193.6252 220.8245 246.0238 255.9032 275.9673 279.6069 316.8699 327.3710 344.0382 375.4834 395.3015 405.5809 405.6812 413.2371 425.5424 448.5091 481.6490 503.0966 507.5276 526.0040 553.2526 584.5398 594.0141 618.0730 624.1452 655.0727 711.6871 721.2979 740.7828 801.2108 815.2220 815.5898 832.7328 833.7776 840.0614 873.8428 918.1206 949.0694 950.5762 964.6832 982.0158 998.6950 1009.7358 1020.7627 1047.7662 1053.3861 1058.0997 1131.7445 1137.0477 1189.5012 1206.7704 1244.9970 1292.4914 1317.8991 1330.2157 1335.9174 1379.4060 1384.6142 1406.3019 1418.0787 1452.0480 1463.3583 1481.2812 1492.8868 1534.6234 1548.8782 1569.0857 1607.8685 1632.8335 1647.6978 2988.0629 3070.5171 3101.7487 3121.4063 3126.3465 3144.1833 3148.2393 3165.8580 3177.1143 3486.9281 3559.6221 3699.2256
redmass: 7.7056 4.0304 5.3452 4.7043 4.2024 2.2592 4.4573 1.2182 6.8310 6.7407 4.1055 4.4337 4.4190 8.0129 5.4767 4.3711 5.5323 5.6560 5.9974 5.6987 5.3531 3.6032 3.0335 3.3714 1.2403 1.2702 6.4445 7.0165 4.8574 2.9877 7.2384 13.6028 4.2654 6.5536 7.6407 5.2707 7.9991 7.8140 4.7051 3.6535 7.1327 5.1059 1.3249 11.1245 1.3882 1.7106 7.4270 7.4399 7.1078 1.4204 1.3703 1.3562 2.7072 1.4981 1.4521 1.4584 1.4661 3.5119 1.3606 1.2369 1.3381 2.6949 2.3325 3.0493 1.4059 2.7800 3.8379 3.9339 4.4521 1.2271 4.9151 4.3865 1.0786 1.1130 4.2005 4.6553 5.3721 6.5236 8.2527 3.6258 1.3664 1.0378 1.0971 1.0994 1.0869 1.0895 1.0968 1.0890 1.0953 1.0965 1.0664 1.0451 1.1040
irintensity: 2.6520 1.6498 4.3012 6.0578 12.1487 66.2180 1.9982 3.6268 3.7894 0.7155 0.5573 21.0484 5.6574 0.7750 11.8824 5.8701 8.1140 5.8526 13.4698 1.3039 16.5325 23.6280 27.9552 32.9681 2.5664 309.4957 17.2311 2.9149 1.2157 4.1751 5.3077 77.8887 8.4663 24.8420 13.0721 1.7880 22.2514 2.0242 1.1414 0.6644 42.0467 5.8860 9.0136 71.0999 32.0857 87.4428 9.2057 36.8820 85.6632 2.1642 3.7100 0.5022 1.1924 0.6182 1.0237 21.6973 47.5646 5.2003 36.0212 9.7415 225.2433 22.0283 3.1705 23.4005 3.9263 37.7514 103.0244 2.1554 19.0893 15.6068 28.5533 35.6068 18.8816 17.4431 508.5156 68.0257 9.2454 7.7393 15.6243 258.7752 481.5577 14.1648 3.5643 17.3332 15.7682 27.9583 15.8826 11.5134 6.9600 6.1047 46.7300 195.7612 24.5646
temp: 298.150 k
press: 1.00000 atm
elementType: 16 16 8 8 8 7 7 6 6 6 6 6 6 6 6 6 6 6 6 6 6 1 1 1 1 1 1 1 1 1 1 1 1
symmnumber: 1
zpe: 609901.3 jmol-1
zpe.correction: 0.232299 hartree
zpe.thermalcorrener: 0.252832 hartree
zpe.thermalcorrenthalpy: 0.253776 hartree
zpe.thermalcorrgfe: 0.181885 hartree
zpe.sumelectzpe: -1670.337303 hartree
zpe.sumelectthermal: -1670.316771 hartree
zpe.sumelectthermalent: -1670.315826 hartree
zpe.sumelectthermalfe: -1670.387717 hartree
dipole: 7.8594 1.1471 0.5005
dipole: 7.9584
quadrupole: -96.2027 -119.4573 -150.2361
quadrupole: -20.2949 -0.9151 -1.6977
quadrupole: 25.7627 2.5081 -28.2708 -20.2949 -0.9151 -1.6977
hfenergy: -1670.5696026 hartree
pointgroup: C01 [X(C14H12N2O3S2)]
dipole: -3.0646901 -0.5991568 0.2288261 debye
polarizability: 471.2318576|-22.1479227|225.9850835|0.7154479|-3.9492646|103.9811451 unknown
InChI: InChI=1S/C14H12N2O3S2/c1-8-2-7-11-12(13(8)21(17,18)19)20-14(16-11)9-3-5-10(15)6-4-9/h2-7,17H,15H2,1H3
charge 0 multiplicity 1
33 atoms
S  3.632017 1.70987 -0.090376
S  0.002979 1.105774 -0.096809
O  2.159674 2.788328 -0.44275
O  4.191142 2.132078 1.372889
O  4.638715 1.794495 -1.348984
N  -0.606047 -1.524526 0.049334
N  -6.844584 0.457595 -0.027545
C  2.7431 0.027323 -0.044686
C  1.342859 -0.106906 -0.036611
C  0.789199 -1.440418 0.036531
C  3.630572 -1.080488 0.025078
C  -1.190651 -0.336138 -0.0066
C  1.647816 -2.559905 0.096183
C  3.03881 -2.373386 0.091467
C  -2.628301 -0.10254 -0.011757
C  5.143194 -0.946646 0.033331
C  -3.517222 -1.217449 0.052875
C  -3.19378 1.202523 -0.080868
C  -4.905009 -1.037413 0.048228
C  -4.582368 1.393952 -0.086286
C  -5.467323 0.274994 -0.021963
H  1.204032 -3.55752 0.151046
H  3.70356 -3.241593 0.144852
H  5.52095 -0.592161 -0.942046
H  5.490683 -0.224923 0.795787
H  5.605911 -1.921672 0.254591
H  -3.086092 -2.221918 0.106023
H  -2.540216 2.081703 -0.132993
H  -5.569639 -1.908297 0.098479
H  -4.994192 2.408571 -0.141173
H  2.354385 3.666432 -0.004362
H  -7.248227 1.388894 -0.077777
H  -7.476549 -0.33703 0.016494
