program: Gaussian 09
title: 000174616
version: EM64L-G09RevD.01
frameworkgroup: C1[X(C23H19N3O6S)]
method: RPBEPBE
basis: SDD
operation: Freq
keyword: #p
keyword: freq=noraman
keyword: PBEPBE/SDD
title: #p freq=noraman PBEPBE/SDD
converged: YES YES NO NO
title: Mulliken charges:
elementType: S O O O O O O N N N C C C C C C C C C C C C C C C C C C C C C C C H H H H H H H H H H H H H H H H H H H
charge: 1.011476 -0.306479 -0.296163 -0.567400 -0.509017 -0.528759 -0.350720 -0.485000 -0.664792 -0.459252 0.104403 0.190210 0.273266 0.367790 -0.426141 0.298835 0.275713 -0.143828 -0.168940 -0.404261 -0.387552 -0.382278 0.445822 -0.229277 -0.228313 -0.494744 -0.460535 0.512402 -0.165370 -0.481530 0.311989 -0.513365 -0.657661 0.351381 0.379260 0.291797 0.295321 0.371952 0.388801 0.238210 0.238733 0.345414 0.256254 0.232261 0.231344 0.409733 0.317965 0.250992 0.212160 0.231236 0.225475 0.251181
chargesum: 0.00000
title: Mulliken charges with hydrogens summed into heavy atoms:
elementType: S O O O O O O N N N C C C C C C C C C C C C C C C C C C C C C C C
charge: 1.011476 -0.306479 -0.296163 -0.157667 -0.509017 -0.528759 -0.350720 -0.105740 0.095961 -0.141287 0.104403 0.190210 0.273266 0.367790 -0.426141 0.298835 0.275713 -0.143828 -0.168940 -0.052880 -0.095754 -0.086957 0.445822 0.008933 0.010419 -0.149330 -0.204281 0.512402 0.066891 -0.250186 0.311989 -0.050213 0.050231
polarizability: 6.20402538e+02 1.57275468e+01 4.05775834e+02 3.23528996e+01 2.44089103e+01 1.70044599e+02
1716.lowfreq: -5.6378 0.0006 0.0013 0.0019 2.1633 4.7284 17.0141 28.2432 30.5474
frequency: 16.9192 28.1819 30.5447 37.5479 43.6680 74.8049 80.1248 97.9299 101.7724 112.5070 118.1599 139.8227 147.6633 153.6978 160.3700 182.4690 201.8092 214.9323 224.8853 231.7621 245.2158 256.8511 272.2157 285.6493 303.6215 317.1925 322.2853 333.4618 346.9261 363.6608 383.6975 393.2014 400.1900 406.9020 424.8590 427.1933 442.6809 456.2320 462.7809 481.7766 514.2059 519.7205 526.2090 550.7233 582.1310 591.0918 601.4981 623.5504 632.8690 651.9048 659.7160 660.9887 674.7458 688.8587 699.4656 712.5488 734.8494 756.2057 757.3124 768.8454 781.9300 793.4034 798.5264 801.0904 808.6323 823.2488 858.4050 861.5308 872.1498 873.7699 883.9275 886.4296 892.0599 910.1319 934.5725 944.5282 963.6418 968.7957 973.1584 984.9855 996.9292 997.9096 1013.9280 1018.9381 1026.6258 1057.8892 1075.7221 1079.1228 1088.3217 1091.6412 1138.2177 1168.8459 1178.6922 1181.8774 1182.8304 1221.3359 1247.2797 1260.3736 1268.3542 1274.3908 1282.2623 1292.9274 1309.0441 1318.4875 1335.3548 1349.5668 1370.0117 1384.3906 1394.7890 1403.3817 1405.2830 1431.1355 1441.5560 1450.3103 1451.1407 1452.3072 1468.7426 1478.9291 1483.3226 1487.4729 1512.6080 1517.2778 1527.7986 1561.4177 1577.1426 1590.6084 1597.0455 1602.8826 1608.4182 1620.0677 1636.3320 2833.9303 2984.9269 3001.7327 3039.4244 3070.5614 3101.1936 3107.6356 3126.6865 3136.5253 3145.6088 3153.3134 3157.8590 3166.3224 3166.4800 3174.1521 3223.2115 3244.4956 3437.0476 3532.8425
redmass: 4.6260 4.8789 3.2189 6.4686 4.5050 6.7498 6.3346 5.5960 6.4789 4.7499 7.5076 8.6467 6.2979 6.4234 6.8211 7.5740 9.8397 1.4184 8.2995 4.5000 5.7504 3.2746 5.9368 6.5667 4.4564 3.9701 6.7418 8.5338 7.3182 6.2809 6.1727 7.6751 9.6793 7.2029 8.4126 3.9090 5.0099 12.4180 3.4725 7.5847 5.7074 5.1815 3.4213 6.4647 5.7761 10.2147 5.8490 5.3942 4.4604 6.2496 2.6942 1.7425 4.1934 2.0734 3.3491 6.1497 2.5541 2.5365 1.3204 6.1159 3.2601 2.0311 1.3482 1.1276 1.9505 7.4759 1.2531 1.3587 2.4961 4.7757 2.0974 2.4873 1.8303 3.4590 2.0481 11.0334 1.4423 1.4422 3.7677 5.0952 1.4040 3.4437 1.3645 2.4904 2.2935 2.2252 2.0262 1.5722 2.4024 1.6354 2.2957 1.2116 1.8657 1.1029 2.1126 1.6801 1.6537 1.5820 1.9291 1.7643 1.1422 1.6893 1.9231 2.7058 1.6196 4.0105 3.7987 8.6780 6.5396 1.2218 9.0226 3.6465 3.3402 4.1021 3.1086 1.1939 2.6362 1.0456 3.1382 1.0621 3.7871 3.5556 4.9295 2.7548 1.9097 3.7889 3.1846 3.8413 6.2482 5.7848 6.7049 1.0758 1.0594 1.0359 1.1012 1.0823 1.1010 1.1008 1.0886 1.0864 1.0907 1.0907 1.0909 1.0990 1.0945 1.0996 1.0916 1.0528 1.1034 1.0767
irintensity: 2.3390 0.4940 2.1919 0.1254 0.2088 1.9304 2.8391 7.4133 1.0685 0.4458 4.5353 2.3153 0.0630 1.9745 2.5798 1.6109 2.9946 1.9015 1.5972 8.7464 0.7897 5.8415 2.1140 2.4422 3.7487 2.4468 12.0391 3.0785 7.1917 4.7311 8.5237 7.9623 0.9642 32.1188 78.1285 4.7759 8.8036 25.1755 7.9347 8.0934 8.4268 10.4221 8.8116 7.3140 22.1307 114.3712 14.5857 11.9291 0.3921 24.5814 8.1764 24.3390 5.6017 33.4739 8.0224 3.1988 26.8711 13.9020 58.5622 0.6601 10.5126 29.7639 22.0264 107.7185 52.5303 146.7373 28.0588 206.5096 53.2048 42.8335 21.8524 5.9127 48.9288 22.6525 0.0980 76.7329 5.0673 4.8439 27.9170 0.1783 5.6830 22.0637 0.1795 28.5355 8.1887 5.6194 11.6942 4.1811 9.7581 10.1010 29.9028 13.4239 3.6597 5.3374 19.7511 51.1515 12.3085 9.4238 4.4941 77.3330 49.1424 88.1100 424.3333 373.2528 19.6523 97.8619 40.9813 2.8992 15.4094 12.0633 43.3248 95.5947 139.7217 46.1161 12.0647 20.9969 4.5731 12.7657 14.4167 34.8457 158.4463 270.5744 542.7903 64.4570 143.7038 425.6627 115.6467 12.1273 2.2252 111.0203 38.5290 1380.4658 18.0083 23.9243 12.8182 65.1499 30.6331 19.2828 6.5775 4.0404 14.2400 15.0893 6.9862 17.7774 1.5394 37.1906 8.0925 73.9041 235.0873 22.0995
temp: 298.150 k
press: 1.00000 atm
elementType: 16 8 8 8 8 8 8 7 7 7 6 6 6 6 6 6 6 6 6 6 6 6 6 6 6 6 6 6 6 6 6 6 6 1 1 1 1 1 1 1 1 1 1 1 1 1 1 1 1 1 1 1
symmnumber: 1
zpe: 1004646.1 jmol-1
zpe.correction: 0.382649 hartree
zpe.thermalcorrener: 0.411280 hartree
zpe.thermalcorrenthalpy: 0.412224 hartree
zpe.thermalcorrgfe: 0.322833 hartree
zpe.sumelectzpe: -1899.098884 hartree
zpe.sumelectthermal: -1899.070254 hartree
zpe.sumelectthermalent: -1899.069309 hartree
zpe.sumelectthermalfe: -1899.158700 hartree
dipole: 4.1295 7.5443 -2.5986
dipole: 8.9845
quadrupole: -138.0003 -208.8629 -205.9639
quadrupole: 17.9472 -11.0981 7.0037
quadrupole: 46.2754 -24.5872 -21.6882 17.9472 -11.0981 7.0037
hfenergy: -1899.4815337 hartree
pointgroup: C01 [X(C23H19N3O6S1)]
dipole: 2.0170652 2.8789284 -0.3713602 debye
polarizability: 621.0050393|-21.6895653|383.6682728|28.2038071|71.3322017|191.549659 unknown
InChI: InChI=1S/C23H19N3O6S/c1-2-18(27)26-13-7-5-6-12(10-13)25-16-11-17(33(30,31)32)21(24)20-19(16)22(28)14-8-3-4-9-15(14)23(20)29/h3-11,25-26,30H,2,24H2,1H3
charge 0 multiplicity 1
52 atoms
S  1.317708 -3.218447 -0.025159
O  -2.054402 2.758882 0.800394
O  -4.120429 -2.051151 -0.991307
O  2.060314 -2.956087 -1.646137
O  2.428192 -2.968743 1.126748
O  0.541968 -4.636766 -0.149976
O  3.53716 -0.806179 -1.435107
N  0.321038 1.788064 0.903643
N  -1.804152 -3.192362 -0.78468
N  4.89228 0.962868 -0.759887
C  -1.637025 0.441476 0.230561
C  -2.179639 -0.8252 -0.206024
C  -0.240016 0.562007 0.551187
C  -1.332727 -1.99569 -0.335621
C  0.03601 -1.818573 0.07686
C  -3.941229 1.498984 0.015049
C  -4.470664 0.254968 -0.431311
C  -2.510362 1.622775 0.366864
C  -3.602766 -0.944497 -0.560772
C  0.559616 -0.624698 0.52977
C  -4.793167 2.628494 0.130407
C  -5.846932 0.155783 -0.75914
C  1.695224 2.120774 0.869033
C  -6.156785 2.521208 -0.197477
C  -6.6852 1.280365 -0.643833
C  2.581544 1.448335 -0.010953
C  2.188561 3.166876 1.69472
C  3.964321 1.722115 0.02512
C  3.562451 3.485478 1.661824
C  4.465861 2.757451 0.856684
C  4.683048 -0.244222 -1.404196
C  5.899973 -0.864562 -2.085877
C  6.008895 -2.380985 -1.797509
H  1.589332 -0.60659 0.896914
H  -0.409654 2.523829 1.061944
H  -4.3579 3.570027 0.478134
H  -6.225816 -0.812405 -1.099555
H  -1.187389 -4.016187 -0.774846
H  -2.809914 -3.21371 -1.030643
H  -6.812337 3.394087 -0.109057
H  -7.747452 1.199289 -0.898205
H  2.210571 0.714969 -0.722424
H  1.507739 3.702767 2.364029
H  3.942078 4.291574 2.298283
H  5.538336 2.983954 0.886683
H  2.718564 -2.157531 -1.590896
H  5.85154 1.317649 -0.774239
H  5.785084 -0.709858 -3.177162
H  6.828763 -0.344227 -1.783186
H  6.152428 -2.576849 -0.720787
H  6.864562 -2.810032 -2.346443
H  5.094497 -2.907395 -2.11854
