program: Gaussian 09
title: 000174174
version: EM64L-G09RevD.01
frameworkgroup: C1[X(C17H23NO3)]
method: RPBEPBE
basis: SDD
operation: Freq
keyword: #p
keyword: freq=noraman
keyword: PBEPBE/SDD
title: #p freq=noraman PBEPBE/SDD
converged: YES YES NO NO
title: Mulliken charges:
elementType: O O O N C C C C C C C C C C C C C C C C C H H H H H H H H H H H H H H H H H H H H H H H
charge: -0.341243 -0.211639 -0.436997 -0.063033 -0.147739 -0.140072 -0.485789 -0.483110 -0.467526 -0.488368 0.038857 -0.644896 0.248627 -0.438037 0.509141 -0.333667 -0.446402 -0.363005 -0.224419 -0.239735 -0.242846 0.235804 0.237258 0.224362 0.235381 0.234635 0.217168 0.228976 0.222962 0.228001 0.213676 0.252630 0.230137 0.229344 0.196577 0.265134 0.191465 0.237389 0.232796 0.243689 0.364753 0.226224 0.225063 0.228475
chargesum: 0.00000
title: Mulliken charges with hydrogens summed into heavy atoms:
elementType: O O O N C C C C C C C C C C C C C C C C C
charge: -0.341243 -0.211639 -0.072243 -0.063033 0.088064 0.097186 -0.026046 -0.031307 -0.015589 -0.046691 0.291488 0.011162 0.248627 -0.172903 0.509141 0.095186 -0.213606 -0.119316 0.001805 -0.014673 -0.014371
polarizability: 2.55873464e+02 -1.69561352e+01 1.66559043e+02 7.02902573e+00 1.57388781e+01 1.56461114e+02
1716.lowfreq: -13.1171 -0.0004 0.0002 0.0007 2.5494 7.2616 15.9409 28.3906 41.9365
frequency: 12.2522 28.3044 41.9008 46.7419 56.0523 85.9891 120.6191 129.0708 156.6763 166.1170 190.4775 209.8719 215.7068 241.6580 275.1705 279.9296 312.8298 326.3386 357.7692 362.6783 383.1901 404.8206 434.7384 452.5651 494.4821 518.1421 536.9766 580.0384 610.5409 623.9687 648.1264 692.5571 702.6204 716.5546 739.4491 764.2573 767.8909 775.3799 814.2821 824.2044 840.3770 848.8998 858.8651 866.0169 909.5538 915.7339 940.4106 962.8875 972.6060 977.1822 979.1940 982.4305 990.9535 993.8952 997.4718 1015.8566 1030.0552 1033.0417 1043.9092 1072.1031 1084.8213 1086.4510 1111.2628 1114.8924 1129.2062 1147.5255 1155.3892 1172.9541 1176.6487 1192.4893 1196.4471 1203.9754 1204.7530 1224.4655 1241.1503 1243.0325 1257.2567 1272.9366 1284.6740 1291.8636 1301.3481 1306.4831 1313.6652 1325.8384 1337.9667 1348.6029 1351.2427 1361.5659 1384.6410 1395.2577 1430.7329 1442.5763 1447.5402 1462.2117 1465.0850 1467.7962 1476.1416 1482.4187 1485.6832 1486.1605 1594.0879 1615.3034 1645.5992 2888.3087 2947.9506 3003.0113 3004.1297 3006.1674 3006.9826 3015.5555 3026.9425 3028.6542 3043.6491 3053.4569 3056.4936 3070.5162 3074.9957 3081.5621 3081.7362 3082.9958 3115.7112 3127.2458 3140.2558 3153.5742 3166.3517 3466.8240
redmass: 4.1892 4.5568 4.2684 5.1615 7.1441 4.5241 4.0916 4.2401 2.1236 3.5308 3.4917 1.0768 3.0303 4.1273 2.7500 3.3483 3.7668 5.3793 2.5171 2.6891 4.3253 2.7956 4.3984 2.5477 3.4365 3.3348 1.1306 3.2159 5.0447 5.3943 5.9670 4.7707 1.7568 3.7719 4.4529 2.0875 3.0253 1.8108 2.8730 2.7641 3.0904 1.2547 3.3310 1.5707 1.5692 2.8960 3.8803 2.0917 1.4086 2.0976 2.1461 2.7291 5.3558 1.4012 5.7321 2.8398 2.1651 2.0211 1.6530 2.0249 2.9092 1.6632 1.5361 1.3447 2.1328 1.2799 2.0168 1.0613 1.1705 1.1113 1.4497 1.5316 1.5648 1.4416 1.5534 1.5841 1.2760 1.3904 1.4166 1.4896 1.5029 1.3599 1.3046 1.3034 1.4481 1.5275 1.4965 1.4798 6.6719 1.1906 1.1647 2.1707 1.0897 1.0975 1.0746 1.0582 1.0839 1.0490 2.2257 1.1137 6.0448 6.1528 10.8537 1.0529 1.0697 1.0590 1.0601 1.0606 1.0818 1.0630 1.0764 1.0856 1.0888 1.0903 1.1015 1.1036 1.1033 1.1038 1.1007 1.0950 1.0872 1.0866 1.0922 1.0958 1.1009 1.0649
irintensity: 0.1426 0.5706 0.4725 0.1169 0.9771 0.7551 0.4566 3.7933 0.1301 1.7722 2.2990 0.4251 3.3435 4.4360 2.5908 2.1992 2.2334 1.3749 1.2660 1.3245 8.1763 0.3360 8.2935 2.8689 1.1278 13.3526 130.1319 4.9635 5.8479 7.2319 3.9096 9.5624 51.3742 15.8306 0.8445 10.3859 30.8297 10.7908 2.2487 6.1941 2.8092 0.8838 11.8983 0.1827 0.0269 12.3687 79.1035 3.4420 1.3805 9.7661 15.4543 66.8938 9.9971 4.5672 62.3064 82.1251 47.1503 16.2506 25.4234 30.9691 417.0898 33.9225 2.3139 5.4382 28.4832 1.2784 0.5023 0.5746 6.3112 0.7098 1.3182 14.4363 10.5672 6.1697 33.8030 1.8626 3.5651 0.7747 13.3826 2.7164 20.5511 0.2088 0.7796 17.9200 29.3565 7.1533 2.3596 1.8209 1.9904 57.7842 5.6690 9.3124 6.5487 9.6688 11.6646 9.9996 2.6538 2.8294 19.6254 27.5327 1.0847 4.1263 141.2549 111.1957 46.0868 5.4151 33.2857 17.8760 16.2949 40.5725 47.8768 8.8881 58.9580 9.1815 10.8754 7.1893 47.4544 63.0903 32.5357 26.5447 7.5944 0.1417 25.8503 39.4939 13.2442 108.9625
temp: 298.150 k
press: 1.00000 atm
elementType: 8 8 8 7 6 6 6 6 6 6 6 6 6 6 6 6 6 6 6 6 6 1 1 1 1 1 1 1 1 1 1 1 1 1 1 1 1 1 1 1 1 1 1 1
symmnumber: 1
zpe: 973135.8 jmol-1
zpe.correction: 0.370648 hartree
zpe.thermalcorrener: 0.390385 hartree
zpe.thermalcorrenthalpy: 0.391329 hartree
zpe.thermalcorrgfe: 0.320299 hartree
zpe.sumelectzpe: -940.422564 hartree
zpe.sumelectthermal: -940.402827 hartree
zpe.sumelectthermalent: -940.401883 hartree
zpe.sumelectthermalfe: -940.472913 hartree
dipole: -2.5234 -1.7920 0.6080
dipole: 3.1542
quadrupole: -102.8898 -140.0239 -119.9973
quadrupole: 1.5586 0.1112 7.3782
quadrupole: 18.0806 -19.0536 0.9730 1.5586 0.1112 7.3782
hfenergy: -940.7932116 hartree
pointgroup: C01 [X(C17H23N1O3)]
dipole: -0.9883146 -0.7296688 -0.1753693 debye
polarizability: 255.8829095|-18.7652609|150.5900347|0.5965204|11.7301144|172.4206768 unknown
InChI: InChI=1S/C17H23NO3/c1-18-13-7-8-14(18)10-15(9-13)21-17(20)16(11-19)12-5-3-2-4-6-12/h2-6,13-16,19H,7-11H2,1H3
charge 0 multiplicity 1
44 atoms
O  -0.413265 0.38718 0.676923
O  0.763238 -1.229095 -0.5245
O  0.854901 2.823865 0.968434
N  -4.456043 0.628586 -0.267306
C  -3.657831 -0.033381 -1.350251
C  -4.165299 -0.265118 0.900918
C  -3.941933 -1.573318 -1.186303
C  -4.280965 -1.730775 0.336444
C  -2.165867 0.312877 -1.100914
C  -2.7289 0.062114 1.388149
C  -1.720479 -0.24169 0.267984
C  -5.898923 0.757523 -0.579415
C  0.772981 -0.215128 0.203493
C  1.983629 0.573032 0.715535
C  3.323754 -0.022893 0.308238
C  1.884438 2.078543 0.261517
C  4.339161 -0.183667 1.284223
C  3.617929 -0.343779 -1.042325
C  5.622044 -0.654462 0.924631
C  4.89941 -0.813583 -1.403808
C  5.906847 -0.96956 -0.423457
H  -3.96556 0.351921 -2.337524
H  -4.883049 -0.067662 1.715554
H  -3.075104 -2.185295 -1.493005
H  -4.796488 -1.878449 -1.81561
H  -5.304641 -2.120023 0.477012
H  -3.593824 -2.42502 0.852476
H  -1.528199 -0.103923 -1.901564
H  -2.064566 1.413501 -1.101201
H  -2.687607 1.135977 1.644158
H  -2.477842 -0.521225 2.29334
H  -1.527438 -1.326945 0.187771
H  -6.020634 1.4211 -1.453801
H  -6.411921 1.231223 0.276246
H  -6.418254 -0.205222 -0.802821
H  1.904501 0.596763 1.820348
H  1.742562 2.122936 -0.840641
H  2.836705 2.574358 0.510224
H  4.124472 0.061149 2.332179
H  2.839565 -0.252557 -1.806555
H  0.0229 2.276276 0.948184
H  6.393762 -0.776071 1.69304
H  5.111611 -1.062657 -2.4497
H  6.900123 -1.335728 -0.706419
