program: Gaussian 09
title: 000174126
version: EM64L-G09RevD.01
frameworkgroup: C1[X(C7H15Cl2N2O3P)]
method: RPBEPBE
basis: SDD
operation: Freq
keyword: #p
keyword: freq=noraman
keyword: PBEPBE/SDD
title: #p freq=noraman PBEPBE/SDD
converged: NO YES NO NO
title: Mulliken charges:
elementType: Cl Cl P O O O N N C C C C C C C H H H H H H H H H H H H H H H
charge: -0.059740 -0.048984 1.293648 -0.481631 -0.599893 -0.402976 -0.527044 -0.306561 -0.392162 -0.404036 -0.272209 -0.313170 -0.284023 -0.567879 -0.568282 0.224968 0.266023 0.270772 0.215803 0.245477 0.197388 0.275345 0.235400 0.275653 0.243722 0.313131 0.259838 0.257121 0.269637 0.384665
chargesum: 0.00000
title: Mulliken charges with hydrogens summed into heavy atoms:
elementType: Cl Cl P O O O N N C C C C C C C
charge: -0.059740 -0.048984 1.293648 -0.481631 -0.599893 -0.018311 -0.527044 -0.306561 0.098829 0.082539 0.170657 0.197574 0.235352 0.005089 -0.041524
polarizability: 1.55291087e+02 3.74413436e+00 1.60804738e+02 -1.14102603e+00 2.34194206e+00 1.09392906e+02
1716.lowfreq: -11.1053 -3.2259 0.0034 0.0035 0.0036 3.0841 9.4751 35.5529 41.1695
frequency: 4.1967 35.5373 41.0075 58.3299 72.1474 93.1795 106.2587 110.4855 133.4388 166.1871 199.0520 206.2954 212.6418 225.0153 263.5570 273.4112 282.5615 313.4706 348.7983 358.2279 379.4822 441.7479 460.9395 479.3389 524.1838 560.2706 636.3889 663.4784 695.0185 708.7857 776.3603 785.8962 803.3341 808.3649 877.1495 908.0714 929.4326 943.6540 998.4039 1026.9006 1029.0293 1042.0125 1045.2127 1058.8722 1063.4561 1105.2578 1108.6454 1189.7559 1190.6670 1223.0645 1232.5381 1251.8527 1259.8215 1262.3890 1290.2918 1327.5254 1329.0736 1338.4539 1347.3910 1354.4382 1356.2549 1366.1498 1436.9544 1441.3472 1451.8191 1461.6608 1467.6428 1473.2125 1474.7791 2983.3184 3002.7125 3007.0310 3012.8897 3016.3007 3058.5748 3063.1172 3075.0481 3079.3863 3084.6057 3089.3226 3094.4118 3143.6535 3152.0884 3507.5521
redmass: 7.4130 12.4989 4.4150 4.8274 5.6693 2.3277 2.5249 2.7102 3.9585 2.3213 3.9540 5.6026 6.6061 5.2692 2.6554 4.1631 3.2894 3.7709 3.0352 5.1108 4.3765 4.7467 3.4782 6.5716 4.0394 2.8689 9.6626 8.4704 5.7507 4.2417 1.1529 1.1897 3.8609 3.3871 2.8455 1.8933 2.8906 2.9573 1.4642 3.3669 2.2354 4.5981 4.0564 2.4483 2.5029 1.9614 1.8944 1.2008 1.9056 1.2478 1.5898 1.1854 1.1616 1.1656 1.1450 1.1874 1.1971 1.2510 1.2235 1.2949 1.3446 1.2487 1.0817 1.0876 1.0912 1.0840 1.0886 1.0886 1.0717 1.0658 1.0645 1.0621 1.0632 1.0609 1.0566 1.0572 1.0984 1.1039 1.0999 1.1003 1.1027 1.1117 1.1119 1.0671
irintensity: 6.2799 2.8001 14.3436 2.5297 12.9335 21.3998 9.9245 25.0332 1.2881 32.6433 0.3995 1.1498 10.0969 1.8403 2.9238 20.2593 48.5913 4.2686 13.5182 13.6886 10.1039 35.0900 2.6924 28.6475 5.6983 22.5230 73.0146 13.9336 109.9787 164.9761 0.1347 19.5395 33.8259 14.4538 44.4781 29.0100 21.3493 138.1098 4.7924 59.6598 8.5502 86.8880 74.3764 22.7237 2.4312 3.1946 59.3287 4.5946 42.9411 4.2737 9.7531 15.2490 6.0494 2.9257 6.0976 14.2600 20.5445 42.4477 1.8246 11.1452 2.4436 0.4821 18.7419 21.8807 6.3730 9.3516 5.3246 32.0300 7.9560 50.2024 20.2549 21.3326 18.0329 12.2867 17.9404 15.5728 14.3332 5.1406 0.1865 15.6187 21.2505 17.6751 7.2438 33.5179
temp: 298.150 k
press: 1.00000 atm
elementType: 17 17 15 8 8 8 7 7 6 6 6 6 6 6 6 1 1 1 1 1 1 1 1 1 1 1 1 1 1 1
symmnumber: 1
zpe: 605672.8 jmol-1
zpe.correction: 0.230689 hartree
zpe.thermalcorrener: 0.248915 hartree
zpe.thermalcorrenthalpy: 0.249859 hartree
zpe.thermalcorrgfe: 0.180410 hartree
zpe.sumelectzpe: -1870.966051 hartree
zpe.sumelectthermal: -1870.947825 hartree
zpe.sumelectthermalent: -1870.946881 hartree
zpe.sumelectthermalfe: -1871.016330 hartree
dipole: 3.1488 2.1724 -3.3530
dipole: 5.0869
quadrupole: -111.6193 -126.2810 -116.6685
quadrupole: 1.9743 -7.0785 1.9020
quadrupole: 6.5703 -8.0914 1.5211 1.9743 -7.0785 1.9020
hfenergy: -1871.1967399 hartree
pointgroup: C01 [X(C7H15Cl2N2O3P1)]
dipole: 0.8171092 -1.1320339 1.4339678 debye
polarizability: 153.4981942|-0.2695971|162.3539326|0.6339654|-4.4874552|109.6366043 unknown
InChI: InChI=1S/C7H15Cl2N2O3P/c8-2-5-10(6-3-9)15(13)11(12)4-1-7-14-15/h12H,1-7H2
charge 0 multiplicity 1
30 atoms
Cl -3.131263 3.588181 0.14944
Cl -2.99743 -3.35825 0.57547
P  0.744349 0.400057 -0.707986
O  1.248418 -1.206062 -1.166651
O  0.838565 1.48512 -1.868803
O  2.979647 1.597811 0.205825
N  -0.819344 0.124986 0.037299
N  1.724087 0.957446 0.728441
C  2.207567 -0.180392 1.579317
C  2.908919 -1.292911 0.76342
C  1.936406 -2.066004 -0.145009
C  -1.531232 1.335098 0.534707
C  -1.638165 -1.068677 -0.286902
C  -2.173107 2.144928 -0.608648
C  -1.898159 -1.880174 0.992658
H  1.313401 -0.567754 2.104137
H  2.884368 0.26203 2.328025
H  3.712732 -0.835086 0.159768
H  3.378712 -2.0202 1.453134
H  2.46297 -2.814359 -0.75872
H  1.15672 -2.575951 0.456679
H  -0.816648 1.970936 1.08611
H  -2.307766 1.015048 1.252398
H  -1.108913 -1.694206 -1.024758
H  -2.604146 -0.7696 -0.736618
H  -1.419104 2.584985 -1.276691
H  -2.91361 1.567276 -1.181565
H  -0.972968 -2.298068 1.415412
H  -2.446633 -1.30906 1.756287
H  2.647429 2.428854 -0.233676
