program: Gaussian 09
title: 000174111
version: EM64L-G09RevD.01
frameworkgroup: C1[X(C6H4Cl3N)]
method: RPBEPBE
basis: SDD
operation: Freq
keyword: #p
keyword: freq=noraman
keyword: PBEPBE/SDD
title: #p freq=noraman PBEPBE/SDD
converged: NO NO NO NO
title: Mulliken charges:
elementType: Cl Cl Cl N C C C C C C H H H H
charge: 0.039224 0.039260 -0.011460 0.144581 0.341012 -0.332957 -0.752192 -0.141178 -0.128174 -0.290301 0.246542 0.327039 0.253448 0.265155
chargesum: 0.00000
title: Mulliken charges with hydrogens summed into heavy atoms:
elementType: Cl Cl Cl N C C C C C C
charge: 0.039224 0.039260 -0.011460 0.144581 0.341012 -0.086415 -0.425152 0.112270 0.136981 -0.290301
polarizability: 1.23340622e+02 -1.89111711e+00 1.02978963e+02 -1.30665981e-03 -7.67566211e-03 6.68473224e+01
1716.lowfreq: 0.0014 0.0017 0.0034 4.2717 6.7540 9.2667 28.2747 87.6900 114.3836
frequency: 28.2333 87.6816 114.3835 163.7908 214.5837 265.7615 301.2782 353.6556 384.6265 445.6725 578.6259 593.4805 659.8227 686.7691 711.7985 745.9572 814.3321 882.2929 910.1564 945.6855 989.9118 1073.8853 1127.5083 1171.5164 1188.5254 1196.6655 1269.8363 1350.5863 1389.2527 1421.6922 1553.3543 1565.9137 3136.4556 3151.7135 3168.9829 3189.4757
redmass: 11.4570 11.1308 21.7623 5.1578 15.1915 8.4244 10.4870 7.5153 14.7332 3.7142 7.7887 8.1389 7.2030 7.4184 6.8257 1.7797 2.2251 6.0785 1.4058 6.8184 1.3488 1.7589 2.4445 1.1256 1.5431 1.0666 2.4609 4.7028 2.6499 2.6574 5.4476 7.1445 1.0894 1.0887 1.0952 1.0988
irintensity: 0.2552 0.8628 0.3415 0.1745 2.9187 0.4217 0.7989 1.2843 16.5563 0.0284 48.5078 33.5405 22.5609 89.9670 40.5297 70.9120 8.8280 30.6386 0.0882 10.0387 0.2345 4.6399 69.1789 6.0478 30.2497 10.8868 17.6424 16.2746 66.4261 44.0889 46.6125 73.8987 3.4878 3.8610 6.3088 2.6419
temp: 298.150 k
press: 1.00000 atm
elementType: 17 17 17 7 6 6 6 6 6 6 1 1 1 1
symmnumber: 1
zpe: 226296.8 jmol-1
zpe.correction: 0.086192 hartree
zpe.thermalcorrener: 0.095565 hartree
zpe.thermalcorrenthalpy: 0.096509 hartree
zpe.thermalcorrgfe: 0.049064 hartree
zpe.sumelectzpe: -1665.235541 hartree
zpe.sumelectthermal: -1665.226169 hartree
zpe.sumelectthermalent: -1665.225224 hartree
zpe.sumelectthermalfe: -1665.272670 hartree
dipole: 1.3760 5.5473 -0.0030
dipole: 5.7154
quadrupole: -76.0998 -71.1999 -81.5113
quadrupole: 1.9594 0.0012 -0.0058
quadrupole: 0.1705 5.0704 -5.2409 1.9594 0.0012 -0.0058
hfenergy: -1665.3217331 hartree
pointgroup: C01 [X(C6H4Cl3N1)]
dipole: -0.7578313 2.1170544 0.0015682 debye
dipolederiv: -0.3615442 0.0846957 0.1765794 0.1789249 -0.1649834 -0.2106851 0.2173467 -0.1090248 -0.5860544 -0.3612272 0.0849951 -0.1763071 0.179239 -0.1655907 0.2116064 -0.2168016 0.1098759 -0.5854741 -0.4210914 -0.3457358 -0.0002727 -0.4869502 -0.6335489 -0.0004295 -0.0003304 -0.0003627 -0.075681 -0.8369771 -0.430385 -0.0003748 -0.0610382 -0.3773302 -0.0001748 -0.0001689 -0.0002681 -0.1193587 0.3845786 0.0669965 0.0001038 -0.0501629 0.1700575 0.0002153 -0.0000909 0.000253 -0.0994359 -0.3599477 0.0796836 0.0000273 0.1483309 -0.0668058 0.0000457 0.0000362 0.0000588 -0.1126387 0.8291892 -0.2150509 -0.0003051 -0.3195263 0.3844731 -0.0009673 -0.0003921 -0.0009371 1.2764207 0.2616665 0.0197976 0.0000534 -0.0247816 0.1791213 0.0001893 0.00006 0.0001659 -0.0811457 -0.0730045 -0.0561364 -0.0000373 -0.3156589 -0.4252729 -0.0002653 -0.000212 -0.0002223 -0.0731116 0.8573875 0.6979497 0.0005766 0.8056605 1.1053145 0.000791 0.0006275 0.0007664 0.0232033 0.0369735 -0.0937009 -0.0000916 -0.0928626 0.0019138 -0.0001249 -0.0000938 -0.0001237 0.1570471 0.0205204 0.0404956 0.0000486 -0.0249674 -0.0727342 -0.0000384 0.0000138 -0.0000104 -0.0419406 0.0494472 0.0604445 0.0000246 0.0642175 -0.0391781 -0.0001227 0.0000263 -0.0001309 0.1538799 -0.0259707 0.0059507 -0.0000251 -0.0004248 0.1045641 -0.0000398 -0.0000207 -0.00004 0.1642897 unknown
polarizability: 122.7572022|3.8878414|103.5623763|0.006402|0.01634|66.8473284 unknown
InChI: InChI=1S/C6H4Cl3N/c7-5-3-1-2-4(10-5)6(8)9/h1-3,6H
charge 0 multiplicity 1
14 atoms
Cl 2.657344 -0.613669 -1.534567
Cl 2.656705 -0.616873 1.534482
Cl -2.488741 -2.172032 -0.001603
N  -0.189195 -0.742425 -0.000317
C  0.553521 0.402668 0.000551
C  -0.038682 1.687672 0.001295
C  2.055787 0.272137 0.000773
C  -1.452358 1.779127 0.001092
C  -2.224002 0.599116 0.000173
C  -1.517627 -0.628621 -0.000546
H  0.584305 2.587024 0.002056
H  2.562787 1.244059 0.001873
H  -1.947066 2.755192 0.001689
H  -3.316277 0.619024 0.00005
