program: Gaussian 09
title: 000174121
version: EM64L-G09RevD.01
frameworkgroup: C1[X(C14H14FN3O3)]
method: RPBEPBE
basis: SDD
operation: Freq
keyword: #p
keyword: freq=noraman
keyword: PBEPBE/SDD
title: #p freq=noraman PBEPBE/SDD
converged: YES YES NO NO
title: Mulliken charges:
elementType: F O O O N N N C C C C C C C C C C C C C C H H H H H H H H H H H H H H
charge: -0.203400 -0.224634 -0.381708 -0.289739 -0.170706 -0.299198 -0.401378 -0.357961 -0.357565 -0.414182 -0.422915 0.329226 -0.551733 0.410074 0.183698 0.190098 -0.562312 0.074204 0.128968 -0.346207 0.105319 0.220200 0.251147 0.216944 0.216221 0.203463 0.217978 0.217187 0.195925 0.276215 0.246700 0.305826 0.323056 0.294192 0.376996
chargesum: 0.00000
title: Mulliken charges with hydrogens summed into heavy atoms:
elementType: F O O O N N N C C C C C C C C C C C C C C
charge: -0.203400 -0.224634 -0.004712 -0.289739 -0.170706 -0.022984 -0.078322 0.113386 0.075600 0.007259 -0.009803 0.329226 -0.305032 0.410074 0.183698 0.190098 -0.256485 0.074204 0.128968 -0.052015 0.105319
polarizability: 3.41958610e+02 -3.65874673e+00 1.83390711e+02 2.95612255e+00 -2.31008525e+00 9.34426331e+01
1716.lowfreq: -9.5598 -0.5916 -0.0007 0.0003 0.0006 3.0677 28.7599 37.3049 48.9391
frequency: 28.7421 37.2413 48.9034 65.2920 68.9645 122.9462 155.3167 167.6235 200.3172 223.3219 245.1432 257.2468 277.8130 297.0997 306.8354 336.7586 364.3008 371.6203 383.8864 432.0470 449.0807 453.9203 469.0946 511.2546 515.4844 543.7817 574.7821 597.3647 607.4169 620.3366 648.7947 657.6609 680.7687 694.5371 702.3018 722.0209 736.0791 775.1054 798.7116 825.2544 844.9569 863.6428 901.2528 923.3659 933.7576 936.6449 958.9308 1024.4733 1043.4501 1050.4510 1065.3576 1087.9748 1100.5409 1129.5860 1145.7094 1169.6614 1176.3457 1202.3655 1210.9550 1239.0395 1248.1517 1251.9074 1275.1507 1295.0612 1328.0249 1330.1981 1342.1129 1356.3764 1372.5922 1377.2109 1390.9825 1405.0316 1413.5779 1446.2279 1455.5769 1458.7488 1462.0910 1470.2213 1501.4853 1527.6116 1552.0370 1559.1986 1589.0157 1627.3930 1637.9582 2875.6112 2889.6078 2923.3306 2946.4703 3043.8457 3051.4913 3054.4063 3125.9281 3146.6660 3162.4093 3165.7562 3469.6777 3491.2728 3555.3776
redmass: 6.7918 7.2509 5.9635 6.5787 3.9783 5.9826 5.9961 6.8778 5.1883 4.4352 3.8426 3.5127 3.9573 4.6997 4.6016 6.4297 4.5718 9.0429 2.2014 5.9132 3.7170 2.8742 3.9435 2.3326 3.9330 6.6416 4.8886 1.6916 3.4542 1.3335 4.0647 2.6884 1.7039 3.8466 5.4837 4.5068 5.9603 5.6346 4.6217 2.0216 1.6173 3.3737 3.4557 1.4413 2.3045 3.5216 1.3760 2.9793 3.2470 1.7147 1.9715 2.3987 2.1825 3.2948 2.5090 3.8052 2.1161 1.2061 1.8767 1.2833 1.5526 1.6034 1.4860 1.4572 1.2310 2.2113 1.7135 1.9507 4.0017 1.6113 1.4996 2.8445 5.8088 1.3475 1.1039 1.0770 1.1032 1.1088 4.5252 4.5836 6.7066 4.1553 7.1056 7.0329 7.0397 1.0708 1.0700 1.0672 1.0712 1.0903 1.0915 1.0924 1.0905 1.0903 1.0940 1.0920 1.0755 1.0635 1.0780
irintensity: 1.1393 2.5206 1.1157 0.8065 3.3746 0.2901 0.6242 0.5801 0.6859 2.2973 3.7100 13.8076 6.2009 16.7984 6.2504 4.1554 6.7126 9.4895 4.4210 12.0879 10.6993 6.1879 5.4557 68.5991 4.5553 40.2535 77.3927 100.2078 14.6958 34.0915 10.5615 97.6708 47.9307 6.5400 0.5363 33.5152 27.5331 5.3965 3.6938 51.1207 3.9502 16.4608 39.2699 22.6746 1.8790 10.5514 8.5638 145.8368 289.6354 1.3356 17.5667 0.6442 30.5842 10.2510 56.8348 25.3192 31.1821 32.2929 26.3606 65.7772 189.2887 78.5696 4.4646 46.1030 41.0552 25.7560 9.4646 5.1091 60.2121 43.1386 1.2722 30.6443 22.4932 4.4372 50.4656 7.9279 47.0987 3.2146 498.0011 15.4181 138.3826 63.0833 400.2061 271.9897 266.0687 80.1276 87.5568 62.2306 86.8699 46.3232 57.8003 19.7228 4.8179 7.7802 2.6463 10.0637 0.6310 33.6728 54.1089
temp: 298.150 k
press: 1.00000 atm
elementType: 9 8 8 8 7 7 7 6 6 6 6 6 6 6 6 6 6 6 6 6 6 1 1 1 1 1 1 1 1 1 1 1 1 1 1
symmnumber: 1
zpe: 703161.5 jmol-1
zpe.correction: 0.267820 hartree
zpe.thermalcorrener: 0.285717 hartree
zpe.thermalcorrenthalpy: 0.286661 hartree
zpe.thermalcorrgfe: 0.221010 hartree
zpe.sumelectzpe: -1030.140390 hartree
zpe.sumelectthermal: -1030.122493 hartree
zpe.sumelectthermalent: -1030.121549 hartree
zpe.sumelectthermalfe: -1030.187200 hartree
dipole: 7.2469 -5.6712 0.1179
dipole: 9.2029
quadrupole: -118.5459 -119.5567 -123.1557
quadrupole: 1.0870 -3.6293 3.0302
quadrupole: 1.8735 0.8627 -2.7363 1.0870 -3.6293 3.0302
hfenergy: -1030.4082101 hartree
pointgroup: C01[X(C14H14F1N3O3)]
dipole: -2.8510398 2.226118 -0.1593424 debye
polarizability: 341.7952461|-4.3230589|182.7688551|-6.6370303|-7.7936382|94.2278525 unknown
InChI: InChI=1S/C14H14FN3O3/c15-10-5-8-11(17-7-9(13(8)19)14(20)21)6-12(10)18-3-1-16-2-4-18/h5-7,16-17,20H,1-4H2
charge 0 multiplicity 1
35 atoms
F  -1.956233 -2.507787 0.039163
O  3.097098 -2.05794 -0.002758
O  5.615411 -0.869013 -0.101422
O  5.701593 1.440555 -0.172657
N  -3.04141 0.143016 0.038555
N  -5.850505 0.679199 0.127706
N  1.586135 1.822237 -0.10208
C  -3.935521 -0.606702 0.968581
C  -3.562682 1.481956 -0.319071
C  -5.362414 -0.689485 0.400807
C  -5.001131 1.36561 -0.86411
C  -1.65635 -0.071508 0.052663
C  -0.717767 0.996221 -0.006296
C  0.674407 0.748389 -0.045409
C  -1.083254 -1.392421 0.064831
C  1.206991 -0.57046 -0.006074
C  0.280184 -1.644007 0.049033
C  2.674595 -0.857772 -0.034277
C  3.526184 0.357178 -0.094353
C  2.940134 1.621854 -0.122398
C  5.00972 0.381699 -0.126162
H  -3.971235 -0.072685 1.943448
H  -3.536806 -1.6168 1.131273
H  -2.922485 1.919741 -1.104979
H  -3.564276 2.160842 0.563993
H  -5.343409 -1.333615 -0.511748
H  -6.018125 -1.167396 1.15042
H  -5.396201 2.381653 -1.045664
H  -4.955952 0.827603 -1.843414
H  -6.849855 0.713141 -0.106287
H  -1.076606 2.029968 0.015137
H  0.667239 -2.667931 0.048369
H  1.221081 2.775508 -0.127537
H  3.5816 2.507657 -0.163027
H  6.602346 -0.727004 -0.125958
