program: Gaussian 09
title: 000174170
version: EM64L-G09RevD.01
frameworkgroup: C1[X(C19H36NO2)]
method: RPBEPBE
basis: SDD
operation: Freq
keyword: #p
keyword: freq=noraman
keyword: PBEPBE/SDD
title: #p freq=noraman PBEPBE/SDD
converged: YES YES NO NO
title: Mulliken charges:
elementType: O O N C C C C C C C C C C C C C C C C C C C H H H H H H H H H H H H H H H H H H H H H H H H H H H H H H H H H H H H
charge: -0.285255 -0.229866 -0.130345 -0.055678 -0.068762 -0.528754 -0.531615 -0.574981 -0.553426 0.025244 0.002505 -0.605364 -0.719875 -0.716629 0.224944 -0.165608 -0.401491 -0.402845 -0.360280 -0.359246 -0.687734 -0.686504 0.288598 0.286778 0.281777 0.262002 0.270485 0.281450 0.263055 0.271815 0.306917 0.248696 0.279296 0.268734 0.270186 0.270404 0.282763 0.242217 0.235915 0.262124 0.243727 0.233828 0.261905 0.234781 0.213295 0.221226 0.221961 0.212863 0.199091 0.197858 0.199783 0.185033 0.217961 0.221945 0.216651 0.216426 0.220516 0.219501
chargesum: 1.00000
title: Mulliken charges with hydrogens summed into heavy atoms:
elementType: O O N C C C C C C C C C C C C C C C C C C C
charge: -0.285255 -0.229866 -0.130345 0.232920 0.218016 0.015025 0.020320 -0.040111 0.002187 0.304540 0.271240 0.217989 0.020381 0.022832 0.224944 0.069173 0.033030 0.031978 0.036670 0.025570 -0.031177 -0.030060
polarizability: 2.37550407e+02 2.36941752e+00 2.10097668e+02 1.33144030e+00 2.39187121e+00 1.81844811e+02
1716.lowfreq: -16.4814 -4.3074 -0.0007 -0.0006 0.0005 4.3965 11.0029 21.9960 36.6722
frequency: 3.3999 20.8498 36.5807 53.4460 59.5464 71.8225 77.4564 84.8192 91.2604 99.7301 138.4345 144.4023 172.6513 186.9852 192.6807 223.1190 230.1540 231.8431 235.9489 237.6548 251.0787 256.5917 283.9126 297.2305 317.7511 324.5387 349.3336 362.2783 369.3523 389.0148 406.8959 440.9663 446.7060 458.7468 476.8251 499.1613 513.6466 574.6457 635.8551 639.3327 682.0352 708.6492 740.5777 746.3398 753.0126 790.5925 808.4334 829.8059 832.4557 858.2845 860.4447 875.0056 875.4677 891.8758 896.2206 911.0968 915.5426 919.3869 927.2148 954.2935 957.0836 966.9792 1001.9681 1011.4664 1016.8332 1019.8881 1033.0701 1043.4739 1056.2979 1061.5827 1063.1275 1081.6620 1100.6707 1102.6023 1110.2717 1125.6240 1133.5072 1140.2385 1157.3012 1160.5454 1163.5956 1166.4750 1178.3483 1191.3887 1217.3954 1220.0947 1226.8519 1232.2686 1253.4412 1254.5372 1271.9932 1285.7527 1288.2064 1291.2359 1296.2531 1299.2019 1309.7118 1316.1641 1322.9750 1324.7231 1332.4058 1338.3481 1341.2202 1349.4240 1352.2260 1359.7300 1364.8838 1374.9876 1395.4860 1397.1659 1398.3713 1411.9525 1432.4467 1455.5288 1461.8528 1463.8082 1468.9613 1470.9826 1472.5149 1473.1043 1478.4279 1479.0133 1480.3070 1485.4885 1486.0090 1487.1988 1487.4974 1489.9104 1496.1464 1510.1014 1514.6528 1643.9314 2954.3372 2961.6664 2979.9436 2981.5439 2984.1620 2987.1756 3002.4233 3003.4621 3004.3654 3006.9952 3014.8497 3018.8446 3023.6879 3026.7255 3036.7060 3044.7590 3047.3137 3048.5994 3056.8092 3073.4740 3076.4230 3076.6646 3077.3503 3079.1234 3079.7901 3080.6065 3081.2877 3084.7782 3090.0341 3093.2672 3099.3238 3102.3214 3108.5696 3113.6440 3154.9255 3173.5436
redmass: 3.5957 3.7805 3.9924 2.5780 2.6746 1.7561 2.4181 3.7750 1.9709 3.6679 4.2334 1.3914 1.9463 2.6153 3.5268 1.6799 1.2171 1.4002 1.1172 1.1437 2.4935 2.8946 3.8611 3.7188 2.8264 3.7888 2.2875 2.3260 2.6947 3.3419 3.2275 2.3845 2.3596 2.5254 3.5085 2.8590 3.4230 2.8268 2.7965 3.0646 4.1564 2.1909 2.9994 1.4049 1.4266 2.2805 2.2035 2.5760 2.4250 1.3559 2.3229 2.0861 1.5317 2.7892 2.4974 1.5686 1.6871 2.3712 1.2830 2.7072 1.5454 3.2632 3.7029 2.5163 1.7927 1.9130 1.7232 2.4389 2.4775 3.1234 1.6584 2.3673 1.6441 1.5907 2.1117 1.8242 2.0816 2.4443 1.3840 2.0405 1.3903 1.6299 1.5462 1.9574 1.2896 1.4147 1.1605 1.3347 1.2318 1.4281 1.6929 1.1678 1.1192 1.4264 1.4121 1.2261 1.2883 1.3350 1.3614 1.3231 1.4324 1.4469 1.5269 1.4587 1.4471 1.2954 1.4161 1.4513 1.2082 1.2012 1.2090 1.1873 1.1543 1.0766 1.0470 1.0784 1.0479 1.0684 1.0716 1.0482 1.0417 1.0416 1.0694 1.0703 1.0661 1.0704 1.0611 1.0610 1.0526 1.0584 1.0793 9.4441 1.0604 1.0596 1.0365 1.0365 1.0593 1.0594 1.0369 1.0978 1.0376 1.0989 1.0839 1.0861 1.0633 1.0625 1.0621 1.0631 1.1043 1.0355 1.1015 1.0892 1.1005 1.0966 1.1000 1.1000 1.1001 1.0903 1.0996 1.0940 1.1030 1.0984 1.0978 1.1009 1.1038 1.0963 1.1039 1.1015
irintensity: 0.2564 0.8654 1.1551 0.2737 0.5271 0.0871 0.4267 0.5593 0.2709 1.4603 3.9970 0.0655 0.3043 0.9597 1.1288 0.1393 0.0040 0.0857 0.0098 0.0827 0.2674 0.0491 9.7765 0.2330 0.0227 4.5449 1.2795 0.1422 1.2725 1.2132 3.6368 0.1520 1.1548 0.1738 2.7722 3.2763 1.1325 2.7789 1.0475 0.4555 2.8228 2.6114 5.6701 9.9852 12.8580 4.0428 40.4182 11.1289 9.2146 0.8379 0.2423 1.8415 1.3498 4.9168 5.6479 2.5459 4.6099 12.6245 1.7144 33.0682 8.4726 6.5220 89.4523 17.5220 0.7099 2.9592 15.4841 108.9552 2.3149 205.0765 17.0039 51.4378 5.7664 2.1826 0.6426 28.4983 49.9755 20.2609 0.6861 1.9849 0.1084 1.2243 4.0032 2.6167 2.4769 0.3495 6.2956 9.2698 2.2220 12.8778 3.7076 1.2403 0.0493 5.6551 9.6618 6.2373 0.9404 4.4360 4.4295 3.5987 8.6599 1.2222 0.9843 19.7805 3.7885 2.7852 21.6106 2.7482 11.0382 32.9290 9.5784 20.4300 28.6365 0.1094 3.5023 6.3345 31.2395 2.5673 6.8175 8.8555 9.9468 17.6847 3.9058 13.3607 1.6546 21.2500 18.6187 43.3754 23.0642 0.4654 35.9242 98.3879 54.0425 39.4310 29.2603 24.9110 1.1373 77.9830 8.4341 13.8558 2.3107 12.1337 5.8819 12.4713 9.2572 6.8754 7.7159 12.3842 0.1832 7.5459 36.4247 10.4255 44.0974 20.8183 3.6931 50.4145 53.3886 14.4612 40.2242 6.1071 0.4556 5.1652 12.9129 10.8300 21.9311 31.9665 2.9559 3.0296
temp: 298.150 k
press: 1.00000 atm
elementType: 8 8 7 6 6 6 6 6 6 6 6 6 6 6 6 6 6 6 6 6 6 6 1 1 1 1 1 1 1 1 1 1 1 1 1 1 1 1 1 1 1 1 1 1 1 1 1 1 1 1 1 1 1 1 1 1 1 1
symmnumber: 1
zpe: 1376314.2 jmol-1
zpe.correction: 0.524210 hartree
zpe.thermalcorrener: 0.549536 hartree
zpe.thermalcorrenthalpy: 0.550480 hartree
zpe.thermalcorrgfe: 0.466647 hartree
zpe.sumelectzpe: -948.808177 hartree
zpe.sumelectthermal: -948.782852 hartree
zpe.sumelectthermalent: -948.781907 hartree
zpe.sumelectthermalfe: -948.865740 hartree
dipole: 12.6495 -0.2406 1.4599
dipole: 12.7358
quadrupole: -67.0280 -117.8231 -128.6870
quadrupole: -3.6078 -3.7496 1.5206
quadrupole: 37.4847 -13.3104 -24.1743 -3.6078 -3.7496 1.5206
hfenergy: -949.3323879 hartree
pointgroup: C01 [X(C19H36N1O2)]
dipole: 4.9706473 0.0008326 -0.6317472 debye
polarizability: 237.4546229|-2.7670104|210.3413988|-1.7798062|0.8295931|181.6968635 unknown
InChI: InChI=1S/C19H36NO2/c1-6-8-15(9-7-2)19(21)22-18-12-16-10-11-17(13-18)20(16,5)14(3)4/h14-18H,6-13H2,1-5H3
charge 1 multiplicity 1
58 atoms
O  -0.906915 0.201608 -0.472528
O  -1.940567 0.559842 1.584311
N  3.269856 0.042649 -0.057409
C  2.692656 1.367785 -0.67702
C  2.488361 0.050839 1.309678
C  2.819546 2.374601 0.500991
C  2.686246 1.512417 1.801964
C  1.220792 1.15732 -1.091133
C  1.001817 -0.272425 1.060325
C  3.02429 -1.239163 -0.936135
C  0.335887 0.763024 0.113138
C  4.764543 0.197374 0.195991
C  3.699854 -1.122113 -2.315886
C  3.444797 -2.525718 -0.200527
C  -2.033135 0.170722 0.399419
C  -3.266127 -0.374795 -0.293906
C  -4.420561 0.666032 -0.198041
C  -3.678346 -1.730004 0.357791
C  -4.132085 2.004988 -0.913656
C  -2.626196 -2.854165 0.223918
C  -5.327702 2.977835 -0.830236
C  -3.136836 -4.199613 0.783273
H  3.316147 1.638307 -1.543947
H  2.957387 -0.694011 1.972124
H  3.776764 2.91973 0.470197
H  2.023459 3.132391 0.426865
H  1.820759 1.816299 2.41199
H  3.574607 1.608787 2.446871
H  1.117421 0.408702 -1.895045
H  0.857216 2.108212 -1.519758
H  0.48217 -0.251516 2.033896
H  0.865612 -1.292345 0.659924
H  1.935608 -1.267761 -1.085309
H  0.053392 1.653501 0.705576
H  5.137549 -0.696495 0.715078
H  5.283531 0.317543 -0.7652
H  4.953452 1.078641 0.819648
H  3.428963 -0.199803 -2.85725
H  4.798986 -1.19634 -2.261859
H  3.353727 -1.96878 -2.934057
H  2.979893 -2.628827 0.79433
H  4.538602 -2.623441 -0.096721
H  3.104615 -3.385315 -0.803974
H  -3.01012 -0.545813 -1.356445
H  -5.325678 0.203465 -0.63829
H  -4.642007 0.853717 0.870811
H  -3.910771 -1.557377 1.42699
H  -4.619842 -2.055772 -0.126225
H  -3.883292 1.810363 -1.976664
H  -3.239655 2.484832 -0.461224
H  -2.350855 -2.974507 -0.843751
H  -1.698082 -2.563886 0.760427
H  -5.580394 3.20614 0.221766
H  -5.107756 3.932988 -1.339913
H  -6.22715 2.54325 -1.304522
H  -2.3764 -4.995491 0.685567
H  -4.042281 -4.532858 0.243489
H  -3.399054 -4.111671 1.853789
