program: Gaussian 09
title: 000174080
version: EM64L-G09RevD.01
frameworkgroup: C1[X(C14H26O)]
method: RPBEPBE
basis: SDD
operation: Freq
keyword: #pfreq=noraman
keyword: PBEPBE/SDD
title: #p freq=noraman PBEPBE/SDD
converged: YES YES NO NO
title: Mulliken charges:
elementType: O C C C C C C C C C C C C C C H H H H H H H H H H H H H H H H H H H H H H H H H H
charge: -0.194527 -0.360755 -0.374897 -0.354015 -0.376893 -0.358254 -0.457025 -0.456334 -0.371521 -0.354525 -0.200558 -0.201621 -0.448162 -0.695923 -0.067646 0.185620 0.190153 0.209228 0.191901 0.189431 0.186741 0.212753 0.196457 0.189765 0.185147 0.204866 0.195333 0.194158 0.204722 0.214939 0.217029 0.194279 0.194892 0.223920 0.225317 0.231062 0.231360 0.209510 0.210216 0.215071 0.168784
chargesum: 0.00000
title: Mulliken charges with hydrogens summed into heavy atoms:
elementType: O C C C C C C C C C C C C C C
charge: -0.194527 0.015018 0.026232 0.022158 0.032316 0.016658 -0.056826 -0.057455 0.060447 0.034645 0.023363 0.023697 0.014261 -0.061125 0.101137
polarizability: 2.11769939e+02 2.92470256e+00 1.37818401e+02 2.53820594e+00 -4.14237447e+00 1.26046207e+02
1716.lowfreq: -8.4113 -0.0011 0.0007 0.0013 5.7572 7.0095 14.6738 29.2964 32.3304
frequency: 13.0991 29.1304 31.7302 45.0741 47.3416 68.6262 75.0526 102.3267 107.0257 113.8245 125.5793 138.4292 145.7480 166.1214 172.7193 201.5169 237.6442 246.3738 289.5675 306.2211 359.7729 418.3880 450.8725 460.6089 540.2712 659.9151 681.8975 719.2551 726.3935 733.8749 766.5569 779.1333 806.7325 857.6045 873.7577 888.1537 889.5983 939.9942 964.0630 975.6550 997.2368 1003.6451 1016.8018 1019.7996 1041.2823 1061.7899 1066.7544 1075.4105 1078.2402 1090.5206 1103.7077 1114.5559 1125.8486 1166.3635 1192.1869 1212.4235 1217.9684 1223.7887 1239.1773 1257.9940 1264.6385 1271.5770 1274.2274 1283.3672 1283.5949 1287.3577 1290.6747 1298.3183 1302.4372 1318.6219 1335.6241 1346.1382 1350.0023 1354.7536 1356.6349 1378.4898 1388.3995 1424.7874 1455.9957 1458.0441 1461.1314 1462.9868 1464.4333 1470.5567 1472.6495 1477.8877 1481.3717 1484.2917 1487.9578 1645.2660 1685.3273 2847.0906 2945.0337 2946.4872 2947.3834 2950.2072 2950.5515 2954.2753 2963.9679 2968.1988 2968.4357 2971.6333 2982.7269 2986.1347 2991.7245 2993.1061 2999.0933 3007.2645 3008.9805 3026.3086 3036.3137 3041.6241 3055.4811 3059.5876 3068.3956 3069.7767 3070.2070
redmass: 4.1224 3.5318 1.8922 3.6513 2.5685 2.7968 2.4579 2.2995 2.1122 2.0792 2.4471 2.4799 2.4065 2.6471 2.1087 2.5116 1.1110 3.8015 3.2724 3.0795 3.7092 2.6796 3.3393 2.8573 2.5129 1.1525 4.8384 1.0648 1.0865 1.1092 1.2178 1.2410 1.6051 1.3569 1.3178 1.9064 2.9605 1.4768 1.2771 1.1093 2.5670 2.8011 2.4245 3.5578 2.4513 2.0387 1.6195 2.4890 2.1689 2.7993 2.4688 2.3256 1.5715 1.9948 1.6299 1.3154 1.3574 1.3060 1.3243 1.2700 1.2447 1.1591 1.2883 1.0966 1.1527 1.0820 1.1165 1.1905 1.2857 1.4113 1.4454 1.5349 1.5805 1.6760 1.6520 1.2289 1.2186 1.1027 1.0846 1.0862 1.0680 1.0671 1.0774 1.0929 1.0791 1.0426 1.0825 1.0997 1.0852 7.5300 6.6240 1.0837 1.0616 1.0617 1.0614 1.0590 1.0594 1.0590 1.0602 1.0608 1.0597 1.0364 1.0956 1.0966 1.0863 1.0709 1.0979 1.0971 1.0992 1.1035 1.1032 1.1037 1.1028 1.0945 1.1004 1.0880 1.0993
irintensity: 0.5038 6.6180 0.3693 0.5855 0.7998 0.5068 0.5345 0.9646 0.1125 1.1726 1.0329 1.3569 0.3804 1.5013 0.9483 0.1766 0.0846 6.2883 3.1966 0.9782 0.9673 0.0622 1.9883 0.2174 0.5358 11.1312 7.1528 12.3821 6.1126 0.1843 1.7860 2.2559 0.6616 0.4115 1.3619 6.3970 12.8482 2.1683 8.0262 47.0921 1.0764 1.4998 1.9101 2.7778 2.3478 3.5282 8.4112 0.5597 0.0790 2.1986 5.6486 9.5682 1.2021 0.6482 1.0052 10.2816 10.0347 4.2057 0.9437 6.4111 6.2007 0.2080 1.2658 0.3294 0.3361 0.1064 0.4393 0.8375 1.8870 7.2546 3.8239 2.0490 0.6577 1.0129 3.4416 6.6790 10.9533 31.9162 2.2790 4.1307 0.1067 0.1663 1.2783 0.3552 1.3740 12.3215 5.1164 21.3725 22.1727 120.7452 0.0242 173.5042 33.4188 11.5612 15.3721 32.1953 29.5490 6.2877 3.0509 50.9465 148.0138 38.7793 11.4458 2.2284 7.2062 30.9213 2.9690 3.8092 2.2656 4.0814 28.2991 111.2276 80.8498 6.2489 74.0716 121.0928 53.3820
temp: 298.150 k
press: 1.00000 atm
elementType: 8 6 6 6 6 6 6 6 6 6 6 6 6 6 6 1 1 1 1 1 1 1 1 1 1 1 1 1 1 1 1 1 1 1 1 1 1 1 1 1 1
symmnumber: 1
zpe: 960533.6 jmol-1
zpe.correction: 0.365848 hartree
zpe.thermalcorrener: 0.385669 hartree
zpe.thermalcorrenthalpy: 0.386614 hartree
zpe.thermalcorrgfe: 0.312980 hartree
zpe.sumelectzpe: -623.050577 hartree
zpe.sumelectthermal: -623.030756 hartree
zpe.sumelectthermalent: -623.029811 hartree
zpe.sumelectthermalfe: -623.103445 hartree
dipole: 0.1044 -2.5912 1.4121
dipole: 2.9528
quadrupole: -92.0350 -106.9646 -93.3445
quadrupole: 17.7206 -9.6365 2.8531
quadrupole: 5.4130 -9.5166 4.1036 17.7206 -9.6365 2.8531
hfenergy: -623.4164249 hartree
pointgroup: C01 [X(C14H26O1)]
dipole: 0.0583928 1.0202718 -0.5524898 debye
polarizability: 211.649421|-4.1711069|137.9636009|-2.6178735|-4.0630147|126.0215246 unknown
InChI: InChI=1S/C14H26O/c1-2-3-4-5-6-7-8-9-10-11-12-13-14-15/h7-8,14H,2-6,9-13H2,1H3
charge 0 multiplicity 1
41 atoms
O  -6.805108 -2.368314 0.523358
C  4.740517 0.223987 0.283919
C  3.297312 0.317597 -0.259671
C  5.527867 -0.984829 -0.270047
C  -2.341798 0.613201 0.232652
C  -3.785637 0.791317 -0.28745
C  2.519938 1.538725 0.30177
C  -1.420971 1.808931 -0.130524
C  -4.707162 -0.394186 0.073861
C  6.970476 -1.077118 0.277861
C  1.12627 1.673501 -0.275039
C  -0.026163 1.680252 0.445423
C  -6.143808 -0.202061 -0.444287
C  7.752809 -2.285636 -0.280369
C  -7.103354 -1.332016 -0.117486
H  5.285967 1.159703 0.038447
H  4.710561 0.164757 1.392236
H  2.742558 -0.609871 -0.012797
H  3.324467 0.380002 -1.367579
H  4.983481 -1.921237 -0.026662
H  5.561729 -0.925178 -1.378238
H  -1.906785 -0.319117 -0.179415
H  -2.361067 0.488351 1.335087
H  -3.76252 0.921777 -1.390067
H  -4.2084 1.730942 0.127624
H  2.462377 1.46479 1.405967
H  3.107628 2.45466 0.075809
H  -1.896707 2.738872 0.249856
H  -1.363273 1.911612 -1.232513
H  -4.732247 -0.532942 1.17202
H  -4.293236 -1.334603 -0.338248
H  7.512653 -0.140196 0.035175
H  6.935461 -1.137128 1.384946
H  1.064673 1.766504 -1.372357
H  0.035379 1.581737 1.542123
H  -6.591334 0.735089 -0.044609
H  -6.156867 -0.068885 -1.548909
H  7.829461 -2.233167 -1.38299
H  7.247716 -3.236464 -0.025361
H  8.779507 -2.328406 0.127754
H  -8.14847 -1.182452 -0.499672
