program: Gaussian 09
title: 000174245
version: EM64L-G09RevD.01
frameworkgroup: C1[X(C18H20ClN5O6)]
method: RPBEPBE
basis: SDD
operation: Freq
keyword: #p
keyword: freq=noraman
keyword: PBEPBE/SDD
title: #p freq=noraman PBEPBE/SDD
converged: YES YES NO NO
title: Mulliken charges:
elementType: Cl O O O O O O N N N N N C C C C C C C C C C C C C C C C C C H H H H H H H H H H H H H H H H H H H H
charge: -0.010985 -0.296381 -0.260210 -0.211481 -0.188945 -0.208235 -0.215614 -0.151725 -0.035061 -0.104288 0.010889 0.011544 0.402421 -0.347637 -0.400259 0.228234 -0.525492 0.228626 -0.666538 -0.662158 -0.379941 -0.015740 -0.536867 0.248242 0.306546 -0.505136 -0.184488 -0.544506 0.465786 -0.417846 0.262040 0.211421 0.242272 0.232419 0.267749 0.255051 0.206796 0.217359 0.244686 0.219016 0.226317 0.295299 0.245540 0.243243 0.232163 0.223899 0.250717 0.241484 0.335448 0.314322
chargesum: 0.00000
title: Mulliken charges with hydrogens summed into heavy atoms:
elementType: Cl O O O O O O N N N N N C C C C C C C C C C C C C C C C C C
charge: -0.010985 -0.296381 -0.260210 -0.211481 -0.188945 -0.208235 -0.215614 -0.151725 -0.035061 -0.104288 0.010889 0.011544 0.402421 0.125825 0.074431 0.228234 -0.257743 0.228626 0.012668 0.027861 -0.084641 -0.015740 0.184080 0.248242 0.306546 0.210964 -0.184488 -0.209058 0.465786 -0.103524
polarizability: 7.95612820e+02 -1.37900039e+01 2.98768859e+02 7.93299511e+00 8.33573869e+00 1.70449358e+02
1716.lowfreq: -3.0279 0.0008 0.0012 0.0016 3.1801 4.8665 15.4726 19.1933 23.5529
frequency: 15.4512 19.1885 23.5474 34.7011 51.5702 52.9636 60.6207 62.3137 73.6867 97.0764 107.3194 112.7923 121.1108 130.9982 138.4132 151.2163 155.6793 178.3283 185.5984 192.5014 200.7064 211.3524 219.4025 223.4591 233.1863 238.8277 264.3426 300.2521 303.6043 311.9950 327.1078 329.4692 338.7381 349.2035 355.5765 372.6513 384.4734 404.4115 447.7201 454.3757 477.5999 492.9028 506.4237 524.1545 528.9660 535.4459 562.6551 624.0159 636.1676 656.3268 667.3537 679.2479 688.6889 695.6671 696.8498 702.9756 731.9756 750.5561 764.2280 784.0853 788.5212 802.6310 830.8988 852.5662 880.0139 892.1906 900.4337 926.5038 927.1326 938.3333 957.4377 993.1023 1013.2663 1053.1046 1066.3460 1075.9181 1094.6763 1111.9488 1112.8780 1113.6324 1126.3852 1143.4781 1153.1379 1161.8776 1164.1765 1173.4564 1184.0410 1193.5892 1209.0034 1219.3095 1256.8552 1264.3971 1288.8246 1297.2058 1333.2994 1340.1485 1345.7210 1350.9723 1361.7469 1364.6318 1384.7735 1388.6974 1391.5102 1398.2045 1423.9544 1436.4864 1443.3222 1446.2315 1453.0446 1454.4686 1463.6339 1467.2822 1467.7115 1470.9094 1475.0207 1479.2210 1484.6292 1490.0689 1507.2121 1521.9737 1529.9639 1548.0102 1589.0435 1617.9300 2972.2997 2986.7778 2990.0290 2993.3126 3002.0084 3009.8957 3059.7487 3066.0566 3074.8712 3086.5060 3097.9884 3107.5299 3112.6568 3128.5963 3129.7816 3131.9165 3169.5275 3185.6355 3194.2923 3199.8422
redmass: 7.8142 5.3968 7.4277 3.6402 8.2075 9.9950 8.2819 10.7636 3.1743 3.3551 3.6661 4.8563 5.5023 5.3178 4.8298 3.7455 10.4151 3.9874 2.0428 2.6268 4.2920 1.1401 3.3576 1.7561 1.9609 2.8077 1.4751 2.6930 3.9090 5.5845 16.2041 4.0854 4.1953 8.7638 4.3894 5.0924 8.4098 4.7582 5.2912 4.4818 6.3289 3.0979 5.6384 7.0575 3.5006 4.5037 5.5840 5.2674 6.0744 6.9711 9.8324 6.1702 8.7294 10.4027 5.5643 7.1461 2.3721 7.0703 4.5429 1.3262 1.8446 2.1355 6.1947 1.7705 1.5603 9.5533 2.7055 2.0170 1.4956 8.0437 1.4379 5.3290 2.9546 2.1656 2.3713 1.8805 1.8128 1.2639 1.2648 2.6377 4.6923 1.7885 2.2707 1.4352 1.9323 2.0568 4.5879 4.6781 5.6142 3.5464 1.7459 1.5521 1.2426 2.4183 4.3963 1.2740 5.4843 1.6370 4.4911 4.0782 1.2948 3.1384 1.3826 2.5383 4.4325 1.2248 2.2529 2.5335 1.0972 1.0608 1.3639 1.1200 1.0498 1.1538 1.1597 1.1725 1.0662 1.1616 1.3445 5.3286 3.8632 10.0388 8.0756 6.7679 1.0320 1.0395 1.0359 1.0677 1.0282 1.0612 1.1020 1.1046 1.0987 1.0998 1.1013 1.0976 1.1047 1.0948 1.1061 1.1011 1.0896 1.0927 1.0924 1.0896
irintensity: 0.4666 0.4821 0.0350 0.9667 0.7980 0.1288 0.8805 0.8203 6.7880 0.9721 2.7683 2.9749 4.3414 6.3760 5.3072 3.0413 0.8488 2.4439 0.7248 8.4628 1.4467 1.0957 1.6522 4.6699 2.4200 13.5444 5.8021 2.0340 1.8226 2.9972 0.6609 9.5116 1.1905 26.3982 1.0880 2.2791 33.3752 0.4704 7.3333 2.5980 4.0809 0.5929 18.4128 12.4076 8.3896 9.3894 67.2643 12.0152 1.2156 29.1819 30.2240 4.5558 2.7885 45.9323 1.4678 34.2187 3.9258 56.6222 18.1908 41.6530 35.0675 17.4924 67.5520 34.6390 17.1486 45.2405 18.7071 2.1121 26.4586 1.4443 21.4531 47.2273 48.5440 92.4825 13.2091 70.7978 23.5788 0.5659 5.1617 79.6022 15.3146 25.3316 47.0791 5.6614 15.9075 55.1650 202.4251 652.5131 1279.2227 313.2404 28.6007 221.8551 25.9029 232.4395 154.4654 19.7287 128.2523 77.7417 71.1841 92.7447 79.1402 1030.2342 54.0933 61.5069 277.4972 3.6898 41.1397 47.5840 83.8675 14.1886 32.8890 9.3105 15.1173 2.2106 8.2295 37.6935 3.5707 25.0358 56.7885 56.4445 439.3137 17.3842 301.4987 312.6573 27.2576 37.2284 29.8039 83.1716 34.6471 72.5222 2.6244 27.4307 29.0445 38.3207 44.6151 37.4176 18.3764 9.8525 35.4652 19.9372 5.3737 10.9942 25.3036 7.1038
temp: 298.150 k
press: 1.00000 atm
elementType: 17 8 8 8 8 8 8 7 7 7 7 7 6 6 6 6 6 6 6 6 6 6 6 6 6 6 6 6 6 6 1 1 1 1 1 1 1 1 1 1 1 1 1 1 1 1 1 1 1 1
symmnumber: 1
zpe: 970402.2 jmol-1
zpe.correction: 0.369607 hartree
zpe.thermalcorrener: 0.399851 hartree
zpe.thermalcorrenthalpy: 0.400795 hartree
zpe.thermalcorrgfe: 0.305707 hartree
zpe.sumelectzpe: -1880.605857 hartree
zpe.sumelectthermal: -1880.575612 hartree
zpe.sumelectthermalent: -1880.574668 hartree
zpe.sumelectthermalfe: -1880.669756 hartree
dipole: 13.6510 -1.8098 -1.5228
dipole: 13.8544
quadrupole: -196.0618 -180.5564 -182.8936
quadrupole: 11.2535 -8.1647 -14.7860
quadrupole: -9.5579 5.9475 3.6103 11.2535 -8.1647 -14.7860
hfenergy: -1880.9754636 hartree
pointgroup: C01 [X(C18H20Cl1N5O6)]
dipole: 5.3461348 0.5367437 0.9171807 debye
polarizability: 793.2447594|38.5957071|260.2284463|1.7820186|60.6090041|211.3578314 unknown
InChI: InChI=1S/C18H20ClN5O6/c1-5-22(6-2)14-10-16(29-3)13(9-17(14)30-4)20-21-18-12(19)7-11(23(25)26)8-15(18)24(27)28/h7-10H,5-6H2,1-4H3
charge 0 multiplicity 1
50 atoms
Cl -2.096475 1.572635 2.275504
O  3.646473 -2.056537 -0.332006
O  1.817207 3.232527 0.289804
O  -3.227085 -2.286991 -2.781967
O  -1.432115 -0.8820 -2.643649
O  -7.245992 -1.182217 -0.31945
O  -7.100019 0.093666 1.574659
N  5.427914 0.134951 0.206744
N  -0.178692 1.045931 -0.067852
N  -0.950112 -0.004919 -0.245053
N  -2.567518 -1.327205 -2.211313
N  -6.577782 -0.475685 0.534077
C  4.053824 0.310982 0.130949
C  6.129614 -1.160001 0.434232
C  6.337487 1.309685 0.204495
C  3.102639 -0.781076 -0.102583
C  3.491404 1.615612 0.234973
C  2.110864 1.88673 0.150365
C  6.732385 -1.761939 -0.851919
C  6.594348 1.902097 1.61025
C  1.741175 -0.525867 -0.150915
C  1.187322 0.792271 -0.019098
C  2.711877 -3.135997 -0.678795
C  -2.319606 0.043105 -0.098138
C  -3.153145 -0.718559 -1.002065
C  0.451448 3.782435 0.177798
C  -3.015607 0.624181 1.024236
C  -4.528728 -0.90961 -0.802218
C  -5.133794 -0.308312 0.313947
C  -4.383388 0.464006 1.235928
H  5.434881 -1.876369 0.89074
H  6.935164 -0.958391 1.167969
H  5.940105 2.079551 -0.479584
H  7.296565 0.972259 -0.229346
H  4.125897 2.484131 0.41298
H  5.928669 -2.033751 -1.554872
H  7.418374 -1.055138 -1.353993
H  7.307977 -2.673377 -0.6061
H  5.664888 2.272932 2.074311
H  7.030904 1.143847 2.284821
H  7.306611 2.74408 1.540499
H  1.017032 -1.321608 -0.344254
H  2.1447 -2.888077 -1.595454
H  3.346989 -4.016605 -0.853064
H  2.009698 -3.336223 0.152432
H  0.595412 4.866159 0.308707
H  -0.207206 3.36801 0.957729
H  0.018787 3.557042 -0.810636
H  -5.113697 -1.50235 -1.50917
H  -4.889673 0.917277 2.091746
