program: Gaussian 09
title: 000174052
version: EM64L-G09RevD.01
frameworkgroup: C1[X(C9H11NO4)]
method: RPBEPBE
basis: SDD
operation: Freq
keyword: #p
keyword: freq=noraman
keyword: PBEPBE/SDD
title: #p freq=noraman PBEPBE/SDD
converged: YES YES NO NO
title: Mulliken charges:
elementType: O O O O N C C C C C C C C C H H H H H H H H H H H
charge: -0.403138 -0.445341 -0.227646 -0.433651 -0.283756 -0.625539 -0.141280 0.519448 -0.390242 -0.366675 0.177841 -0.389376 -0.344844 0.282869 0.255808 0.217644 0.265880 0.242655 0.229665 0.281381 0.219560 0.250438 0.377909 0.376757 0.353633
chargesum: 0.00000
title: Mulliken charges with hydrogens summed into heavy atoms:
elementType: O O O O N C C C C C C C C C
charge: -0.025229 -0.068584 -0.227646 -0.080018 -0.002375 -0.152087 0.124600 0.519448 -0.147587 -0.137011 0.177841 -0.169816 -0.094406 0.282869
polarizability: 1.55854584e+02 -1.04879772e+01 1.04805308e+02 1.38994401e+01 1.41933921e+01 8.86127261e+01
1716.lowfreq: -12.5986 -5.5296 -0.0008 -0.0006 0.0009 2.1636 11.1174 29.8459 40.7167
frequency: -10.9870 29.8419 40.7087 53.8548 96.8407 140.2094 178.2060 222.7297 271.2472 301.8016 326.8866 360.2039 398.5790 402.7715 409.2447 431.5812 463.9519 496.8261 532.5409 591.5444 605.8680 636.5023 702.7026 719.7558 740.7247 765.6801 795.1908 811.1413 825.3436 847.8509 925.8649 940.9579 957.4343 980.0828 1003.0591 1012.4089 1051.0609 1102.0975 1118.4546 1144.5935 1168.7996 1179.3523 1217.1364 1240.5565 1249.4302 1260.3930 1281.6996 1304.1751 1323.9909 1377.9452 1393.1970 1427.3861 1443.5344 1471.1816 1506.1454 1599.0150 1628.7382 1667.4057 2981.1277 2982.7137 3062.8694 3110.4681 3121.2403 3137.1081 3170.0884 3369.2276 3511.2546 3542.4062 3582.4930
redmass: 9.0250 4.8875 5.2770 6.6966 4.9056 5.9540 5.2194 6.1604 4.1937 2.4788 6.4638 1.1159 1.3977 2.5046 2.8089 3.8399 5.1596 4.3507 2.9158 2.5072 1.5564 6.7072 3.7947 3.4888 4.0846 2.9571 2.5376 1.6655 2.0986 2.7101 1.7065 1.6355 1.3638 2.6286 2.9616 3.0484 2.7253 1.4563 2.0629 1.3766 1.1915 1.1109 2.1642 1.3269 2.9488 1.3559 1.3768 1.3890 1.3039 1.4028 5.9567 2.7370 1.2935 1.1029 2.8270 6.4760 6.4853 8.4195 1.0828 1.0644 1.0983 1.0878 1.0901 1.0963 1.0951 1.0757 1.0639 1.0678 1.0660
irintensity: 3.8855 1.0285 0.6725 0.2150 0.8496 0.3589 0.9731 0.6032 6.7466 3.4010 2.4846 143.0459 108.0880 65.7513 8.2550 5.5437 14.4256 17.6827 12.0774 66.9913 156.5530 2.0240 20.5370 6.8132 8.4331 16.1284 47.7811 20.0455 10.6852 31.0903 21.5789 27.7572 0.3630 46.5881 3.5985 1.6252 146.6594 63.3556 32.8353 222.0528 0.2667 5.3899 2.8476 43.3195 31.4355 2.4374 42.5363 9.3339 6.8559 5.3535 13.4315 15.0788 17.3337 14.8721 93.5584 11.2824 34.2845 191.7939 30.4302 23.3208 9.6520 17.4763 17.4260 11.4126 5.7950 0.2893 22.9697 30.9332 39.1154
temp: 298.150 k
press: 1.00000 atm
elementType: 8 8 8 8 7 6 6 6 6 6 6 6 6 6 1 1 1 1 1 1 1 1 1 1 1
symmnumber: 1
zpe: 500920.8 jmol-1
zpe.correction: 0.190791 hartree
zpe.thermalcorrener: 0.203877 hartree
zpe.thermalcorrenthalpy: 0.204821 hartree
zpe.thermalcorrgfe: 0.149902 hartree
zpe.sumelectzpe: -704.095117 hartree
zpe.sumelectthermal: -704.082031 hartree
zpe.sumelectthermalent: -704.081087 hartree
zpe.sumelectthermalfe: -704.136005 hartree
dipole: -1.6383 0.4408 0.6447
dipole: 1.8150
quadrupole: -84.4424 -71.3258 -85.1635
quadrupole: -10.5350 -4.2084 -1.0067
quadrupole: -4.1318 8.9848 -4.8529 -10.5350 -4.2084 -1.0067
hfenergy: -704.2859073 hartree
pointgroup: C01 [X(C9H11N1O4)]
dipole: 0.6264742 -0.2585908 0.2248587 debye
dipolederiv: -0.5993394 0.0849204 0.3041856 0.1457621 -0.2619798 -0.2376307 0.2777217 -0.1528953 -0.9120851 -0.8120164 0.1801756 -0.0781042 0.1842059 -0.2902402 -0.1521746 -0.2857575 -0.1567988 -0.3239883 -0.5621155 -0.0844396 0.2441083 -0.3456762 -0.6960577 0.1710214 0.2022259 -0.014929 -0.5597431 -1.4168168 0.2960044 0.2133838 0.3281555 -0.247856 -0.2326528 0.272391 -0.2397721 -0.3901919 0.0513877 0.0628817 0.1766589 -0.0674084 -0.0043908 0.0067458 0.228285 0.0219886 -0.1824116 0.0856601 0.0953321 0.0109753 0.020712 0.0895037 0.0137223 0.0238157 0.0560397 0.1559742 0.178831 -0.1521698 -0.0891511 -0.203217 0.0493114 -0.0952794 -0.0339793 -0.1369773 0.0946347 0.1714053 -0.0293989 -0.0139279 -0.090788 -0.1436508 0.05746 -0.047055 0.0390513 -0.1328596 0.0090046 -0.1008939 -0.0316908 -0.0037104 0.07203 -0.1157683 -0.0726875 -0.0530174 -0.0572937 0.0437664 0.0075849 -0.10528 -0.0567546 0.0705408 -0.0817184 -0.0478008 -0.135776 -0.0310857 0.6889437 0.0500862 -0.6165459 0.3816521 0.94051 0.1343261 -0.5139075 0.1715606 1.0342681 -0.3424643 0.0683241 -0.0019485 -0.1901595 -0.0018609 -0.0351252 0.1685519 -0.1474999 -0.1711501 -0.2593928 0.0201141 0.0113952 0.2816268 -0.0835829 -0.1526517 -0.1271479 -0.0550411 -0.0770511 1.2842818 -0.3620444 -0.2975697 -0.3981953 0.1791602 0.1103249 -0.335623 0.1097995 0.1487882 0.0382876 -0.0047409 0.038004 -0.0348429 0.03894 0.0972086 0.0244278 0.0341596 -0.0339033 0.01186 -0.001006 0.0081824 0.0619306 -0.1420156 -0.0797811 -0.0062317 -0.0428875 0.0533605 -0.0219148 -0.0054655 0.0688353 -0.0122391 0.0030569 0.0584143 0.116341 0.0324533 -0.0739385 0.0361979 -0.0559607 0.0951038 -0.053205 0.0405812 0.0688012 0.0908465 0.0749641 0.0615852 0.0655253 0.1032167 -0.010546 0.0922321 -0.0462331 0.0669501 -0.0120155 0.0629297 0.0986608 0.1610882 -0.0697658 -0.0574036 0.0181069 -0.0183282 -0.0262285 -0.076926 0.0534561 0.2350631 0.0136996 0.1106865 -0.000835 0.1167592 -0.041453 0.0786206 0.0113796 0.0729737 0.124202 0.0421447 -0.0412453 0.0756089 -0.0398027 0.0608221 0.0788841 0.087511 0.0790128 0.0892273 0.337775 -0.0409836 0.0279679 -0.0490584 0.0957486 -0.005115 0.0731358 0.056813 0.3505188 0.3869001 -0.0907432 0.0068501 -0.075227 0.1975987 0.1324586 -0.0141148 0.1131342 0.208035 0.407301 -0.040469 0.0217432 -0.0108585 0.1398454 0.1391875 -0.0033866 0.1572581 0.2913841 unknown
polarizability: 154.2514071|-11.9010873|110.1771162|-16.1701743|-9.9768085|84.8440957 unknown
InChI: InChI=1S/C9H11NO4/c11-7-3-1-6(2-4-7)5-8(10-14)9(12)13/h1-4,8,10-12,14H,5H2
charge 0 multiplicity 1
25 atoms
O  -1.237633 -1.113302 -1.575811
O  -4.233846 0.928027 -0.565029
O  -2.644259 -1.687315 0.179019
O  4.532174 -0.606386 -0.611968
N  -3.17271 1.120505 0.479462
C  -0.795106 0.885672 1.020034
C  -1.875458 0.664028 -0.090704
C  0.610796 0.481533 0.606919
C  1.170013 -0.742489 1.047096
C  1.395008 1.312367 -0.236017
C  -1.995135 -0.818408 -0.441453
C  2.470355 -1.134843 0.659439
C  2.69273 0.938322 -0.633812
C  3.229948 -0.290202 -0.184445
H  -1.124777 0.32717 1.91391
H  -0.818295 1.963495 1.278839
H  -1.583867 1.202586 -1.015876
H  0.586032 -1.39885 1.703468
H  0.987761 2.269508 -0.585253
H  -3.148614 2.14961 0.600035
H  2.887715 -2.085836 1.016287
H  3.300725 1.576779 -1.281498
H  -1.277442 -2.09175 -1.757679
H  -4.768558 0.186806 -0.174648
H  4.821844 -1.477928 -0.244315
