program: Gaussian 09
title: 000174265
version: EM64L-G09RevD.01
frameworkgroup: C1[X(C18H17N5O4)]
method: RPBEPBE
basis: SDD
operation: Freq
keyword: #p
keyword: freq=noraman
keyword: PBEPBE/SDD
title: #p freq=noraman PBEPBE/SDD
converged: YES YES NO NO
title: Mulliken charges:
elementType: O O O O N N N N N C C C C C C C C C C C C C C C C C C H H H H H H H H H H H H H H H H H
charge: -0.241785 -0.269182 -0.160815 -0.268468 -0.451533 -0.436577 -0.437894 -0.025333 -0.163814 0.298411 0.234842 0.529922 -0.493780 -0.305993 -0.465515 0.101669 -0.420429 0.128467 0.217397 -0.768244 0.101043 0.248090 -0.286556 -0.319434 -0.223734 -0.229094 -0.538411 0.311282 0.228506 0.333589 0.258180 0.325111 0.418502 0.277803 0.245701 0.287044 0.252096 0.281789 0.248136 0.235945 0.232533 0.226868 0.236850 0.246817
chargesum: 0.00000
title: Mulliken charges with hydrogens summed into heavy atoms:
elementType: O O O O N N N N N C C C C C C C C C C C C C C C C C C
charge: -0.241785 -0.269182 -0.160815 -0.268468 -0.117944 -0.111467 -0.019393 -0.025333 -0.163814 0.298411 0.234842 0.529922 -0.182498 -0.077487 -0.207335 0.101669 -0.142626 0.128467 0.217397 0.016598 0.101043 0.248090 -0.004767 -0.071298 0.012211 0.003439 0.172123
polarizability: 4.05462958e+02 -1.55157327e+01 3.14361696e+02 -1.45088402e+01 -1.79312696e+01 1.41542895e+02
1716.lowfreq: -7.2322 -2.8703 -0.0010 -0.0009 -0.0008 2.8186 16.4199 23.2882 33.7890
frequency: 16.4052 23.2543 33.7848 44.6492 54.6001 62.5135 80.7817 94.1551 105.2700 110.6749 129.3418 137.8208 154.2922 165.5423 201.7460 218.5462 230.4540 253.1481 262.9188 271.6696 281.5925 300.2541 315.5020 345.8192 364.6840 381.4200 394.6725 433.5523 446.1145 475.4861 488.3160 501.6093 513.0273 528.8398 532.8723 545.5976 563.3272 574.5748 582.6611 589.5990 619.2843 638.6667 680.3710 690.1183 708.3227 714.9300 740.7707 752.2432 763.9826 774.6232 803.4025 807.1087 810.6222 849.6728 860.8957 885.7202 910.6461 915.0163 928.2739 949.2121 958.6961 960.4699 976.5668 978.4630 990.3361 1007.3456 1012.0006 1028.4431 1039.3713 1108.6598 1111.7260 1126.7524 1135.0819 1147.8211 1152.8611 1173.0663 1178.7098 1188.0906 1203.8256 1224.1215 1239.4644 1242.5764 1272.9627 1276.9763 1288.9655 1296.2516 1330.2648 1347.3707 1369.5316 1386.6100 1408.8179 1412.1267 1430.9984 1442.6013 1444.1818 1452.1504 1468.6718 1469.7992 1479.9345 1488.9118 1502.5491 1572.5536 1586.3334 1598.1404 1608.1810 1621.7758 1648.0077 1656.2474 1699.0041 2971.3995 2980.6774 3014.7737 3065.3083 3066.0200 3082.9221 3126.2228 3127.3127 3138.3111 3143.5386 3155.0415 3163.7791 3170.1919 3178.3858 3184.7248 3622.9537 3625.0965
redmass: 5.0837 4.6791 6.4417 6.4139 5.7962 4.4304 7.1646 5.9305 3.4839 5.2528 6.8767 7.6880 5.9229 1.0725 2.7016 4.4981 3.3851 1.7950 5.5334 8.2355 5.1845 5.5855 4.8564 5.7316 5.5678 5.6512 7.6635 3.1028 6.6537 5.4071 4.3346 5.9507 4.4622 1.1914 4.2574 3.8919 4.6056 1.0471 5.6363 6.7253 4.5324 4.2816 5.5814 7.0966 12.0629 5.7638 3.9372 4.3416 1.2891 5.8817 3.2675 4.9851 1.6818 4.2010 1.4869 6.6269 1.4477 4.8927 1.3614 3.4217 1.4179 3.0138 5.6874 3.5418 1.3327 1.5980 1.8621 2.1184 2.0309 2.0069 1.3032 2.2479 2.7514 2.3316 1.3892 1.1513 1.8645 1.4504 2.2342 3.1363 2.1736 1.4810 1.6925 2.3465 2.7534 1.5794 1.6209 4.0778 1.2317 9.5322 3.1176 3.3568 1.4740 1.0686 1.7411 1.0703 1.3955 1.0623 1.5081 5.6825 3.4929 2.0355 7.2855 5.9477 5.0862 4.1005 6.8933 8.2257 7.8866 1.0321 1.0368 1.0864 1.0960 1.1045 1.0857 1.1010 1.1006 1.0862 1.0881 1.0901 1.0968 1.0940 1.0988 1.0940 1.0800 1.0818
irintensity: 0.1904 0.2142 0.9640 0.0256 4.1942 6.2208 3.0855 1.0900 4.0722 2.1459 4.0321 2.0525 3.2553 0.7225 3.7734 1.4133 4.3221 1.5859 0.2417 5.7133 5.8465 0.3763 3.6212 2.6395 1.6869 4.1640 0.6891 2.7055 28.2131 15.8058 4.6668 19.8334 5.0748 16.6155 11.6145 4.0729 7.0483 236.4360 3.4962 4.8746 14.1737 27.0091 9.5565 15.9351 18.4815 9.8297 1.4247 0.6325 102.7662 3.0499 27.6919 17.6949 27.0497 0.8304 0.2151 29.0364 39.2531 5.4165 1.6483 6.8594 1.5342 48.1485 24.2192 17.1360 0.2251 22.2916 36.7941 43.6375 10.8860 40.7551 3.3396 7.8283 129.3648 124.8868 4.3528 19.2732 47.3206 97.6672 42.6927 116.7265 55.0422 13.2923 27.9252 41.8107 20.5724 22.6295 29.1389 61.0637 79.9803 34.8389 0.8936 1.1617 21.4277 18.2040 1.8472 17.6118 100.3670 14.1565 13.8916 70.6586 304.6185 390.5916 8.0148 70.3404 226.8738 113.9921 6.6520 85.6629 994.0948 62.6631 5.7629 584.8065 1.8313 34.2860 7.0535 8.7805 19.7193 1.7553 7.0905 11.9450 5.1008 9.0225 22.9883 8.8064 96.0678 48.3214
temp: 298.150 k
press: 1.00000 atm
elementType: 8 8 8 8 7 7 7 7 7 6 6 6 6 6 6 6 6 6 6 6 6 6 6 6 6 6 6 1 1 1 1 1 1 1 1 1 1 1 1 1 1 1 1 1
symmnumber: 1
zpe: 868345.3 jmol-1
zpe.correction: 0.330735 hartree
zpe.thermalcorrener: 0.355129 hartree
zpe.thermalcorrenthalpy: 0.356073 hartree
zpe.thermalcorrgfe: 0.274453 hartree
zpe.sumelectzpe: -1268.841288 hartree
zpe.sumelectthermal: -1268.816895 hartree
zpe.sumelectthermalent: -1268.815950 hartree
zpe.sumelectthermalfe: -1268.897570 hartree
dipole: 6.4299 -3.9966 0.6205
dipole: 7.5962
quadrupole: -182.2527 -120.7853 -162.7614
quadrupole: -9.3824 -9.0950 -7.7910
quadrupole: -26.9862 34.4811 -7.4949 -9.3824 -9.0950 -7.7910
hfenergy: -1269.1720234 hartree
pointgroup: C01 [X(C18H17N5O4)]
dipole: -2.4029056 1.7754393 0.0733409 debye
polarizability: 402.6783835|-20.5436651|318.8173532|17.306586|-0.948096|139.8718124 unknown
InChI: InChI=1S/C18H17N5O4/c1-10(24)16(23-22-13-5-3-4-6-15(13)27-2)17(25)19-11-7-8-12-14(9-11)21-18(26)20-12/h3-9,16,19-21H,1-2H3
charge 0 multiplicity 1
44 atoms
O  7.532476 0.162472 -0.596947
O  0.804937 -3.198204 -0.800798
O  -2.169321 -2.203489 1.896336
O  -1.688701 2.200755 0.27046
N  5.356273 -0.862455 -0.615612
N  5.462872 1.340537 -0.265365
N  0.335167 -0.938898 -0.270678
N  -2.535878 -1.556954 -0.855208
N  -2.255666 -0.350446 -0.445858
C  4.031017 -0.418545 -0.453439
C  4.09961 0.991403 -0.229465
C  1.629786 -0.350937 -0.278324
C  2.814157 -1.114114 -0.48451
C  2.927407 1.74028 -0.032601
C  1.692321 1.055822 -0.060522
C  6.278962 0.206683 -0.504563
C  -1.529873 -2.559436 -0.464149
C  0.004364 -2.242321 -0.541075
C  -1.770849 -3.012595 1.031388
C  -1.446214 -4.467955 1.296611
C  -3.247439 0.641471 -0.704047
C  -2.942204 1.98323 -0.303762
C  -4.50425 0.359424 -1.302765
C  -3.901049 3.008093 -0.507455
C  -5.447283 1.380432 -1.507459
C  -5.141278 2.704198 -1.106216
C  -1.40534 3.540887 0.804021
H  2.747765 -2.189194 -0.661565
H  2.960827 2.821751 0.133465
H  5.660846 -1.816743 -0.79266
H  0.754924 1.604168 0.078723
H  5.862618 2.267618 -0.143372
H  -0.505412 -0.323582 -0.115663
H  -1.681772 -3.43844 -1.110322
H  -2.230197 -5.107521 0.846715
H  -0.490737 -4.73409 0.808202
H  -1.399194 -4.661847 2.379003
H  -4.707818 -0.676353 -1.590793
H  -3.687496 4.037673 -0.208222
H  -6.413983 1.155312 -1.968646
H  -5.872298 3.505806 -1.258791
H  -1.379226 4.29698 -0.003484
H  -2.14965 3.828687 1.569605
H  -0.412102 3.456738 1.268702
