program: Gaussian 09
title: 000173990
version: EM64L-G09RevD.01
frameworkgroup: C1[X(C13H17N2S)]
method: RPBEPBE
basis: SDD
operation: Freq
keyword: #p
keyword: freq=noraman
keyword: PBEPBE/SDD
title: #p freq=noraman PBEPBE/SDD
converged: YES YES NO NO
title: Mulliken charges:
elementType: S N N C C C C C C C C C C C C C H H H H H H H H H H H H H H H H H
charge: 0.258011 -0.120303 -0.398042 -0.324654 -0.672294 0.074142 -0.385449 -0.631514 -0.306154 -0.049725 0.516722 -0.415742 -0.347499 -0.184149 -0.206669 -0.231154 0.279237 0.264609 0.312244 0.302184 0.236727 0.254624 0.234959 0.251366 0.231342 0.249870 0.248285 0.329376 0.236562 0.234758 0.252746 0.249273 0.256311
chargesum: 1.00000
title: Mulliken charges with hydrogens summed into heavy atoms:
elementType: S N N C C C C C C C C C C C C C
charge: 0.258011 -0.120303 -0.068666 0.219192 -0.057866 0.074142 0.105902 0.086153 -0.056283 0.198560 0.516722 -0.179181 -0.112741 0.068596 0.042604 0.025157
polarizability: 3.80969318e+02 4.29374958e+00 1.66491467e+02 1.08820568e+00 -1.42990311e+01 9.03197004e+01
1716.lowfreq: -0.0022 -0.0008 -0.0007 2.6667 5.3807 8.5154 19.1431 40.0836 49.2643
frequency: 19.0051 39.9263 49.2401 62.9930 88.8198 113.8854 150.1371 182.2065 202.0185 207.6051 220.8392 233.9877 278.4780 359.1166 392.6681 394.4421 399.4375 474.5544 499.8689 521.1022 544.7044 576.0163 587.9908 613.4166 642.2936 686.3690 691.9809 726.4428 772.8284 778.8259 821.6160 823.8568 831.5068 840.9022 907.0362 911.7276 959.3226 964.4725 975.2693 986.3570 1004.8488 1013.3763 1020.6480 1025.8602 1077.3251 1094.9313 1095.9132 1152.2671 1183.0030 1184.3682 1193.8200 1200.0372 1211.6048 1252.4562 1270.5499 1276.9472 1307.9688 1319.3870 1326.4748 1339.0519 1339.7486 1373.4461 1393.4539 1402.7190 1433.7241 1455.2767 1464.7468 1472.7067 1477.9441 1484.7086 1485.5090 1503.8070 1574.4568 1603.2423 1608.9043 1648.2348 2996.8974 2998.9841 3021.7909 3065.2627 3072.7712 3080.9150 3101.2054 3105.8444 3124.4210 3135.1423 3143.6722 3155.4004 3155.7633 3158.4913 3167.3910 3183.4600 3488.3451
redmass: 3.7758 4.2655 4.2569 3.2262 3.9832 3.7492 3.2269 2.4819 1.6966 2.3611 2.7669 1.7550 3.9488 3.9058 3.0890 4.4672 2.7930 5.4875 2.9947 3.7923 4.4099 5.6171 4.7899 6.3737 4.4102 1.8432 3.9101 1.4014 1.6570 1.3201 1.4517 1.6490 1.5587 3.6790 2.1089 1.4379 1.8434 1.3975 1.3855 5.6922 1.3401 1.4802 2.6612 2.2476 2.1448 1.7201 1.9046 1.4330 1.2130 1.6390 1.2540 1.3918 2.2250 1.7047 1.3535 1.4280 1.4631 1.4326 1.3642 1.4553 1.3835 2.2255 3.8991 1.2102 1.9882 1.1260 1.2299 1.0913 1.0781 1.6298 1.6828 1.2664 4.3518 5.7696 5.2924 3.9415 1.0638 1.0362 1.0609 1.0660 1.1018 1.0953 1.1004 1.1021 1.0905 1.0912 1.0880 1.0905 1.1096 1.0905 1.0959 1.1015 1.0760
irintensity: 0.0235 0.5526 0.3816 0.1551 1.6336 1.9450 0.8845 2.1570 0.1460 4.0926 2.8688 0.1780 0.9889 1.3742 2.8271 7.4656 0.0400 1.7542 18.5866 2.4163 0.9369 10.8309 3.6081 0.0981 18.0994 33.9617 5.6597 3.0236 85.3449 24.2256 10.4775 7.2739 65.0883 2.2486 7.2937 3.7336 43.4566 41.8556 0.7741 5.4097 0.9850 8.6721 5.0110 0.3245 16.6494 21.8528 2.6503 2.7753 5.1478 8.0694 2.7639 12.3667 12.1116 73.4955 53.6700 39.7618 25.4671 3.0621 298.0936 146.2125 68.3303 3.3090 8.8507 13.5420 12.3791 17.4522 30.3524 4.6730 13.6794 67.4291 11.1917 26.8480 285.2092 151.9086 74.8490 1040.7973 21.2885 9.3024 24.8683 3.2321 0.3503 8.0171 17.9023 28.7977 7.1636 1.8607 5.8292 0.4651 1.5502 0.5701 11.6620 9.8259 77.1192
temp: 298.150 k
press: 1.00000 atm
elementType: 16 7 7 6 6 6 6 6 6 6 6 6 6 6 6 6 1 1 1 1 1 1 1 1 1 1 1 1 1 1 1 1 1
symmnumber: 1
zpe: 723516.4 jmol-1
zpe.correction: 0.275573 hartree
zpe.thermalcorrener: 0.291440 hartree
zpe.thermalcorrenthalpy: 0.292384 hartree
zpe.thermalcorrgfe: 0.230202 hartree
zpe.sumelectzpe: -1011.747033 hartree
zpe.sumelectthermal: -1011.731166 hartree
zpe.sumelectthermalent: -1011.730222 hartree
zpe.sumelectthermalfe: -1011.792404 hartree
dipole: -4.8902 1.9938 -0.1859
dipole: 5.2843
quadrupole: -20.0583 -78.9599 -103.5800
quadrupole: 2.0223 -0.4399 -5.8035
quadrupole: 47.4745 -11.4271 -36.0473 2.0223 -0.4399 -5.8035
hfenergy: -1012.0226061 hartree
pointgroup: C01 [X(C13H17N2S1)]
dipole: 1.9514529 -0.7116688 -0.0873042 debye
polarizability: 380.014803|12.7862491|168.3570706|-9.5403922|10.1137447|89.4086116 unknown
InChI: InChI=1S/C13H17N2S/c1-2-15-10-11-16-13(15)8-9-14-12-6-4-3-5-7-12/h3-9,14H,2,10-11H2,1H3
charge 1 multiplicity 1
33 atoms
S  2.153525 2.1196 -0.451397
N  3.554427 -0.13332 -0.421209
N  -1.297119 -0.789786 -0.252391
C  4.60191 0.920167 -0.570868
C  4.009836 2.233282 -0.035395
C  2.266726 0.302139 -0.395034
C  3.966706 -1.564306 -0.394558
C  4.086296 -2.120778 1.03913
C  1.121622 -0.53114 -0.353914
C  -0.178586 -0.026177 -0.228288
C  -2.6542 -0.361894 -0.071533
C  -3.676144 -1.294444 -0.380748
C  -2.983064 0.931241 0.406642
C  -5.028299 -0.928869 -0.223077
C  -4.339721 1.286088 0.552519
C  -5.366158 0.363649 0.239405
H  4.874595 1.005089 -1.640803
H  5.499711 0.629966 0.000742
H  4.102889 2.332662 1.055751
H  4.415679 3.119419 -0.542154
H  3.25034 -2.155527 -0.991881
H  4.937948 -1.628633 -0.915267
H  3.121982 -2.073649 1.57351
H  4.40898 -3.175766 1.001344
H  4.833863 -1.560223 1.626811
H  1.266054 -1.615104 -0.42492
H  -0.337548 1.04953 -0.100111
H  -1.183653 -1.793827 -0.433104
H  -3.420424 -2.295259 -0.751064
H  -2.211084 1.655185 0.686331
H  -5.814708 -1.650667 -0.463724
H  -4.595986 2.283329 0.923763
H  -6.415695 0.64752 0.361294
