program: Gaussian 09
title: 000174106
version: EM64L-G09RevD.01
frameworkgroup: C1[X(C16H22N2O6S2)]
method: RPBEPBE
basis: SDD
operation: Freq
keyword: #p
keyword: freq=noraman
keyword: PBEPBE/SDD
title: #p freq=noraman PBEPBE/SDD
converged: YES YES NO NO
title: Mulliken charges:
elementType: S S O O O O O O N N C C C C C C C C C C C C C C C C H H H H H H H H H H H H H H H H H H H H H H
charge: 1.064378 1.064214 -0.592976 -0.592811 -0.431969 -0.554374 -0.431840 -0.554476 -0.061649 -0.061582 -0.393658 -0.393529 -0.405728 -0.405729 -0.585726 -0.585551 0.375438 0.375436 -0.135429 -0.148217 -0.148230 -0.135679 -0.325236 -0.298974 -0.298960 -0.325067 0.256635 0.337801 0.337452 0.256628 0.288492 0.285382 0.288533 0.285287 0.334199 0.333492 0.334144 0.333555 0.376308 0.299909 0.299868 0.376372 0.283673 0.282458 0.282445 0.283663 0.415865 0.415762
chargesum: 2.00000
title: Mulliken charges with hydrogens summed into heavy atoms:
elementType: S S O O O O O O N N C C C C C C C C C C C C C C C C
charge: 1.064378 1.064214 -0.177112 -0.177049 -0.431969 -0.554374 -0.431840 -0.554476 -0.061649 -0.061582 0.200778 0.200551 0.168147 0.168091 0.081965 0.082148 0.375438 0.375436 0.240879 0.151692 0.151639 0.240692 -0.041563 -0.016517 -0.016515 -0.041404
polarizability: 4.35256233e+02 7.36468422e+00 2.29612189e+02 2.69713688e-02 4.74922150e-02 1.67713117e+02
1716.lowfreq: -0.5110 -0.0020 -0.0016 -0.0005 1.5785 9.3219 12.0825 29.7523 30.9434
frequency: 11.9973 29.7481 30.9171 35.6405 44.9673 59.5483 61.9335 79.1769 85.6535 113.6607 119.9444 131.4548 154.2729 158.6876 180.0653 188.8180 200.6038 218.5053 223.7389 244.2887 246.5409 278.9207 287.0254 296.6593 297.3856 324.2443 325.6549 327.6911 333.2929 338.3380 352.6076 387.9275 403.9656 408.9775 410.6346 422.4069 436.3192 469.3002 491.6115 498.3767 526.0168 543.0662 543.8033 568.9514 610.0410 654.2835 666.6047 689.1135 734.4678 751.4876 771.7231 787.1675 798.7909 809.7819 823.0798 825.0660 848.7325 867.2219 871.3405 871.7465 893.7541 909.7450 956.2460 957.4054 977.8015 978.8867 997.1232 997.3890 1011.7295 1013.1085 1021.0632 1041.0239 1042.5195 1044.3356 1044.4364 1048.3423 1048.6973 1073.2186 1073.9170 1122.2565 1123.5581 1145.8757 1149.4327 1162.3627 1163.3406 1213.5166 1215.1765 1239.9365 1249.6173 1259.3202 1260.1587 1293.2360 1294.0641 1300.9882 1312.8443 1342.6078 1348.5156 1349.0870 1365.8417 1374.7804 1391.1408 1392.0872 1420.9982 1421.1030 1444.1245 1444.9768 1450.2247 1468.5278 1479.0729 1492.1405 1509.0522 1530.3957 1534.4673 1554.4509 1636.4978 1639.4928 3006.8061 3006.8424 3013.1959 3013.2414 3025.0788 3026.7213 3057.8289 3057.9277 3066.7565 3066.7772 3100.5985 3100.6856 3156.0692 3156.2607 3179.0219 3179.9444 3183.1979 3184.0963 3201.0839 3201.4376 3485.3291 3485.6922
redmass: 8.5671 5.7133 7.8921 7.8234 6.3853 4.2411 9.5789 6.3583 4.2286 6.7412 4.3216 6.5262 5.6780 7.9646 4.4649 5.3565 3.9227 2.7648 2.5582 5.0564 3.0331 7.0064 7.6350 5.3632 4.7908 1.3100 1.5527 2.5586 6.1331 3.1576 4.2126 2.9978 3.3041 2.8633 2.8378 4.6622 3.8561 3.9978 5.7921 5.3906 3.6800 8.9812 8.5662 3.5555 3.8045 6.6993 6.6811 3.9371 3.8134 3.2604 2.1255 1.4707 1.9458 3.5875 9.8006 9.3795 1.4012 1.7151 1.6798 2.1476 1.2637 1.4584 4.4433 4.4694 1.4083 1.4347 1.8568 1.8491 1.8403 1.6735 4.5435 1.5399 1.3316 2.3727 2.1960 1.5118 1.5577 2.8255 2.8064 1.6234 1.4805 3.8251 2.9591 1.4136 1.4961 1.2222 1.2094 1.2136 1.2063 1.3274 1.3146 1.2785 1.2064 2.3435 1.5623 1.7009 1.2311 1.2426 2.1491 2.2349 1.2661 1.2559 1.1005 1.1005 1.1287 1.0740 1.8277 2.1807 1.4282 1.1941 1.3069 1.9609 5.2626 7.1284 4.8736 4.9815 1.0659 1.0658 1.0629 1.0631 1.1038 1.1034 1.0676 1.0680 1.0903 1.0907 1.1024 1.1024 1.1116 1.1116 1.0923 1.0923 1.0935 1.0939 1.0995 1.0997 1.0668 1.0668
irintensity: 4.6092 4.3337 7.9476 0.1409 0.6955 0.0400 0.0599 0.6327 0.1323 34.1555 0.0015 0.0751 1.2700 0.5644 9.3143 6.1784 0.9481 25.4268 13.3916 5.4797 4.4986 23.3710 12.3443 3.0741 22.7923 141.4715 98.6655 9.6612 39.9358 0.1595 8.7766 0.1235 3.4421 0.6313 0.1552 14.7749 2.8968 0.8930 32.3616 10.6928 33.2460 19.1374 185.6490 3.3112 9.7969 0.3860 15.6589 4.7330 7.9450 4.5185 21.2919 2.1069 14.8215 16.9658 164.6084 2.7723 79.8486 4.6495 3.4305 5.0267 25.7984 3.1586 297.9974 8.5890 0.2892 7.7480 2.6526 0.3331 5.8774 9.8483 5.7825 0.0345 12.2983 26.1850 0.5859 29.1941 153.8040 3.9624 4.7834 16.5261 0.0583 0.0056 34.7658 0.6837 31.9018 0.7464 1.1950 22.3321 0.2177 0.2138 6.3798 7.5983 12.7789 2.3959 11.7477 0.0442 11.0972 1.3198 1.1502 5.4785 12.4472 0.5401 14.5947 12.7595 31.2429 24.8983 35.5668 10.4413 82.9755 17.6656 98.6086 3.1630 57.6768 1.0583 161.7727 0.1522 18.9537 8.2425 5.9476 2.9178 807.3520 63.5236 2.3119 2.2924 1.0223 1.0094 22.5444 4.2231 2.8061 2.8109 0.1390 0.5574 6.1602 0.2930 7.8549 0.5890 92.8134 114.1076
temp: 298.150 k
press: 1.00000 atm
elementType: 16 16 8 8 8 8 8 8 7 7 6 6 6 6 6 6 6 6 6 6 6 6 6 6 6 6 1 1 1 1 1 1 1 1 1 1 1 1 1 1 1 1 1 1 1 1 1 1
symmnumber: 1
zpe: 971694.3 jmol-1
zpe.correction: 0.370099 hartree
zpe.thermalcorrener: 0.397391 hartree
zpe.thermalcorrenthalpy: 0.398335 hartree
zpe.thermalcorrgfe: 0.310206 hartree
zpe.sumelectzpe: -1977.016381 hartree
zpe.sumelectthermal: -1976.989088 hartree
zpe.sumelectthermalent: -1976.988144 hartree
zpe.sumelectthermalfe: -1977.076274 hartree
dipole: 0.0313 0.0153 -3.9419
dipole: 3.9420
quadrupole: 40.8190 -138.9437 -141.7809
quadrupole: 69.9973 0.0034 0.0095
quadrupole: 120.7876 -58.9752 -61.8124 69.9973 0.0034 0.0095
hfenergy: -1977.3864795 hartree
pointgroup: C01 [X(C16H22N2O6S2)]
dipole: -0.0123786 -1.5507734 0.0163166 debye
polarizability: 435.5148712|0.0069062|167.7167564|0.9923557|0.4761253|229.3499104 unknown
InChI: InChI=1S/C16H22N2O6S2/c19-25(20,21)13-1-7-17-9-3-15(4-10-17)16-5-11-18(12-6-16)8-2-14-26(22,23)24/h3-6,9-12,19,22H,1-2,7-8,13-14H2
charge 2 multiplicity 1
48 atoms
S  -7.147359 0.812949 -0.972083
S  7.150313 0.828702 0.959564
O  -7.042904 2.249763 0.212863
O  7.048074 2.245961 -0.247744
O  -8.505635 0.848203 -1.822734
O  -5.702282 0.744866 -1.722148
O  8.50887 0.873807 1.809277
O  5.705465 0.77488 1.711656
N  -3.421569 0.244467 1.011924
N  3.419704 0.229497 -1.0094
C  -4.8758 0.284186 1.421417
C  4.873667 0.26406 -1.420227
C  -5.686583 -0.87912 0.777458
C  5.685527 -0.889631 -0.760638
C  -7.138252 -0.510074 0.473881
C  7.137948 -0.515892 -0.467246
C  -0.716175 0.218298 0.212333
C  0.714581 0.21496 -0.208481
C  -3.094528 0.549825 -0.291853
C  2.441383 -0.108291 -1.913623
C  -2.443472 -0.078922 1.921663
C  3.09305 0.554568 0.289704
C  -1.754988 0.543298 -0.702519
C  1.092288 -0.122945 -1.537819
C  -1.094226 -0.09905 1.546624
C  1.753676 0.553968 0.700974
H  -4.911124 0.235359 2.521792
H  -5.274523 1.268481 1.113498
H  5.272323 1.25267 -1.126408
H  4.908431 0.199881 -2.51984
H  -5.203668 -1.212903 -0.158723
H  -5.706222 -1.753078 1.455439
H  5.205177 -1.208572 0.181997
H  5.702872 -1.774003 -1.425097
H  -7.718746 -1.348522 0.056816
H  -7.688101 0.004598 1.275725
H  7.720293 -1.347589 -0.039443
H  7.685019 -0.012432 -1.278041
H  -3.938481 0.786233 -0.960907
H  2.765305 -0.361848 -2.925168
H  -2.767809 -0.316933 2.936855
H  3.937285 0.801624 0.954483
H  -1.543292 0.828021 -1.736452
H  0.355693 -0.424295 -2.286879
H  -0.357842 -0.38866 2.300487
H  1.542348 0.8544 1.730534
H  -7.413965 3.075305 -0.214791
H  7.412354 3.080131 0.1688
