program: Gaussian 09
title: 000174906
version: EM64L-G09RevD.01
frameworkgroup: C1[X(C23H24N2O3S)]
method: RPBEPBE
basis: SDD
operation: Freq
keyword: #p
keyword: freq=noraman
keyword: PBEPBE/SDD
title: #p freq=noraman PBEPBE/SDD
converged: YES YES NO NO
title: Mulliken charges:
elementType: S O O O N N C C C C C C C C C C C C C C C C C C C C C C C H H H H H H H H H H H H H H H H H H H H H H H H
charge: 0.285322 -0.252371 -0.214623 -0.265400 -0.156222 -0.056415 0.262426 0.499340 0.286273 0.196531 -0.549670 0.191624 -0.393949 -0.396899 -0.417829 -0.431904 -0.410694 0.069868 -0.783681 -0.660431 -0.659802 -0.383292 0.340786 -0.416573 -0.340858 0.341435 -0.363448 -0.242100 -0.686476 0.269787 0.227628 0.228343 0.234787 0.225899 0.221827 0.232000 0.265693 0.263483 0.214980 0.220743 0.239986 0.219600 0.216354 0.246982 0.221749 0.262058 0.252856 0.251710 0.210326 0.210399 0.207895 0.231932 0.232013
chargesum: 0.00000
title: Mulliken charges with hydrogens summed into heavy atoms:
elementType: S O O O N N C C C C C C C C C C C C C C C C C C C C C C C
charge: 0.285322 -0.252371 -0.214623 -0.265400 -0.156222 -0.056415 0.262426 0.499340 0.286273 0.196531 -0.279882 0.191624 0.062022 0.063787 -0.196003 -0.199904 -0.410694 0.069868 -0.039524 0.019898 0.025284 -0.383292 0.340786 -0.154516 -0.088002 0.341435 -0.111738 0.178625 -0.014635
polarizability: 7.94420366e+02 -5.44444591e+00 2.84754312e+02 8.03526117e-01 -8.29887613e+00 1.45842396e+02
1716.lowfreq: -15.1323 -4.8724 -2.4473 -0.0014 -0.0001 0.0023 4.2063 16.0499 34.3104
frequency: -11.1631 15.9276 34.2928 43.8185 49.5846 61.0904 69.8918 81.7500 89.7414 105.3441 111.9137 121.0195 124.1215 148.7106 162.2158 184.4211 188.6349 206.2210 210.9122 212.6936 235.1780 244.2946 259.4460 265.5356 283.2109 312.0484 318.4006 339.3526 352.3034 372.1164 403.1633 413.8432 423.0403 431.0317 444.3438 445.2805 454.9968 502.4725 506.2757 518.6924 536.4743 547.2754 549.4980 587.3527 589.9477 615.3029 634.3591 634.7894 667.7707 677.8130 683.0087 723.8364 741.3716 743.0008 753.1611 786.1248 787.1563 795.7415 798.0404 818.4772 824.5307 842.5962 846.5344 849.3723 862.6912 892.8314 921.8970 923.8551 941.3986 947.8293 956.3926 979.3692 1013.7877 1026.6415 1027.3407 1042.4093 1053.7865 1073.6468 1076.5598 1093.4093 1094.4177 1114.1191 1118.3928 1136.3620 1146.0262 1168.0181 1180.6518 1200.5067 1201.4520 1222.0275 1258.5716 1262.8983 1263.9530 1279.7416 1288.6993 1301.5219 1339.6414 1348.4764 1349.9603 1361.1706 1375.7465 1377.8568 1386.4088 1390.3378 1395.5931 1400.9719 1412.6979 1421.4098 1444.0223 1447.9907 1451.7485 1461.2466 1465.0239 1466.0302 1468.3282 1477.8415 1478.4904 1482.5264 1483.7038 1489.3010 1492.5673 1496.0975 1510.2389 1535.6493 1545.1074 1562.0233 1607.2892 1616.1966 1653.4726 2955.1421 2985.9946 2986.7084 2997.2430 2997.2996 3002.2805 3009.1491 3013.4091 3045.8092 3051.1857 3076.2796 3082.7786 3083.4359 3094.1038 3094.7551 3096.0648 3105.8764 3127.4034 3154.2683 3157.8061 3168.7339 3176.2980 3179.9599 3185.7809
redmass: 4.0122 4.8320 3.4090 4.6214 4.5283 3.8270 3.2757 3.7753 4.5008 4.2580 1.8041 3.7522 3.7545 1.3688 3.2849 3.0952 2.7421 1.1656 2.3592 2.8148 2.9258 1.2542 4.8602 5.8184 3.6241 3.9331 4.8039 4.6708 3.3326 6.1007 4.3276 4.4181 5.1231 3.6338 3.5722 6.9236 3.2474 7.0535 3.0125 5.5689 3.5104 4.9035 5.6455 5.6807 6.3825 4.6967 6.3093 3.8051 6.0690 7.1825 5.5306 3.6821 3.9942 5.8136 4.7963 1.3399 1.1622 3.5680 1.7309 1.3038 1.3701 3.9494 1.7189 1.3542 3.3190 4.4056 3.6401 2.3627 1.3578 2.6377 1.3357 4.4419 2.8523 1.5930 2.4066 3.2845 3.5046 2.1711 1.8332 2.3938 1.8440 1.5461 1.7653 1.4389 1.9168 2.4345 3.3352 2.7027 2.7602 2.3509 1.5936 1.4991 1.1427 1.5103 1.4500 2.2019 1.2713 1.5169 2.2551 1.7966 2.7051 2.3393 1.2238 1.2953 1.2944 1.2990 1.9946 4.8631 1.3263 2.2600 3.4109 1.0400 1.0654 1.1940 1.2121 1.1434 1.1184 1.1336 2.7295 2.0061 1.3990 1.4523 1.2011 3.2781 6.0530 7.4547 7.0329 8.6446 8.9090 1.0554 1.0355 1.0357 1.0601 1.0365 1.0609 1.0389 1.1074 1.1027 1.1023 1.0939 1.0997 1.0999 1.1011 1.0989 1.1010 1.1013 1.0988 1.0880 1.0857 1.0913 1.0974 1.0942 1.0915
irintensity: 0.1617 2.8776 0.6783 0.1247 1.6899 0.0798 0.3359 2.0353 0.8022 0.0474 2.6052 0.3409 0.3571 0.0036 0.2393 2.5245 1.6486 1.0714 0.9999 0.3485 0.0277 1.0801 4.1944 3.8680 6.8483 1.6727 3.6440 4.5684 1.4641 2.7887 3.9729 2.9972 3.6947 10.6816 7.7558 17.7997 2.5188 5.3339 12.2362 8.9867 16.5270 0.3779 8.0038 0.2600 21.9864 7.2033 12.3557 4.4482 1.4832 4.2116 3.9110 2.1830 0.5994 3.6387 7.2846 17.3665 7.2579 14.8182 27.8047 0.4019 65.6782 13.9626 39.0960 16.2347 0.5384 114.6548 32.7772 3.7967 0.8163 15.1838 0.0126 7.6889 30.0277 6.3086 31.3898 84.0361 63.8758 16.1239 73.2215 0.8908 24.7666 11.6342 12.2364 4.7144 91.6809 15.5327 0.6523 531.5280 25.6106 70.1110 198.3867 11.9956 0.0607 25.7271 18.4153 14.2487 9.5923 291.6615 3.5202 43.8878 4.4990 2.6083 3.1829 30.6941 163.4159 34.3727 159.0863 6.9755 68.9544 149.3198 32.6891 11.8554 0.7777 98.9863 48.1888 41.2764 11.7935 35.6401 29.6008 109.9621 58.1997 94.9423 4.0698 31.3923 46.6315 22.0695 835.0612 764.1136 312.3721 33.5020 34.5542 30.5712 51.5592 36.8796 82.8440 9.4397 34.8665 4.4592 9.9370 3.2681 41.8239 45.2414 21.2795 28.0018 81.9533 34.8370 28.3946 2.6535 5.4418 15.2792 15.9093 24.2688 12.1446
temp: 298.150 k
press: 1.00000 atm
elementType: 16 8 8 8 7 7 6 6 6 6 6 6 6 6 6 6 6 6 6 6 6 6 6 6 6 6 6 6 6 1 1 1 1 1 1 1 1 1 1 1 1 1 1 1 1 1 1 1 1 1 1 1 1
symmnumber: 1
zpe: 1099816.8 jmol-1
zpe.correction: 0.418898 hartree
zpe.thermalcorrener: 0.445966 hartree
zpe.thermalcorrenthalpy: 0.446910 hartree
zpe.thermalcorrgfe: 0.361002 hartree
zpe.sumelectzpe: -1622.004602 hartree
zpe.sumelectthermal: -1621.977534 hartree
zpe.sumelectthermalent: -1621.976590 hartree
zpe.sumelectthermalfe: -1622.062498 hartree
dipole: -6.7912 2.4033 -0.2941
dipole: 7.2099
quadrupole: -93.9110 -175.4457 -182.7314
quadrupole: -12.8252 1.0271 -0.6672
quadrupole: 56.7850 -24.7497 -32.0354 -12.8252 1.0271 -0.6672
hfenergy: -1622.4235005 hartree
pointgroup: C01 [X(C23H24N2O3S1)]
dipole: -2.6530693 -1.0004226 -0.0816873 debye
polarizability: 793.8340271|14.5218712|284.3277749|11.8749633|13.6389644|146.855272 unknown
InChI: InChI=1S/C23H24N2O3S/c1-5-25(6-2)15-8-10-17-14(4)21(23(26)28-19(17)12-15)22-24-18-11-9-16(27-7-3)13-20(18)29-22/h8-13H,5-7H2,1-4H3
charge 0 multiplicity 1
53 atoms
S  2.611812 1.55227 0.352249
O  -1.92695 1.669623 0.257489
O  0.147406 2.587388 0.350281
O  7.718573 -0.121869 0.295158
N  -6.487866 0.111633 0.087548
N  2.192827 -1.111238 0.148374
C  -2.266138 -0.755421 0.138375
C  -5.123769 -0.160959 0.104762
C  -0.830304 -0.969467 0.158817
C  -2.788188 0.574616 0.184961
C  -4.153729 0.882696 0.175572
C  0.043899 0.149102 0.217663
C  -7.500907 -0.966548 0.111925
C  -6.99878 1.499743 0.045926
C  -3.258168 -1.785926 0.068789
C  -4.62607 -1.513616 0.04826
C  1.505635 0.025087 0.225861
C  -0.498637 1.5176 0.278847
C  -0.295072 -2.381343 0.117482
C  -7.852083 -1.513314 -1.291286
C  -7.129516 2.148566 1.443403
C  4.01996 0.423419 0.288502
C  3.578975 -0.932731 0.180277
C  5.388695 0.759892 0.33081
C  4.54059 -1.975803 0.113395
C  6.327478 -0.297979 0.263207
C  5.903341 -1.656962 0.154892
C  8.238828 1.255358 0.408206
C  9.761453 1.153053 0.419982
H  -4.427355 1.937378 0.239801
H  -7.154314 -1.784804 0.769003
H  -8.411626 -0.557269 0.58747
H  -6.346597 2.111474 -0.603596
H  -7.988855 1.476665 -0.446302
H  -2.949123 -2.833034 0.017057
H  -5.321788 -2.352522 -0.028677
H  0.3895 -2.563042 0.963157
H  0.334693 -2.532848 -0.776528
H  -1.093432 -3.136152 0.129293
H  -8.244881 -0.709511 -1.939645
H  -6.963522 -1.942153 -1.786228
H  -8.623807 -2.301579 -1.216679
H  -7.818396 1.568408 2.083582
H  -6.152364 2.197639 1.953691
H  -7.526035 3.176655 1.355098
H  5.7055 1.802353 0.413255
H  4.203097 -3.012997 0.030171
H  6.672964 -2.432714 0.106003
H  7.881417 1.855338 -0.454028
H  7.857984 1.716558 1.342799
H  10.208878 2.160335 0.501541
H  10.104501 0.546997 1.275734
H  10.126868 0.681455 -0.508103
