program: Gaussian 09
title: 000173935
version: EM64L-G09RevD.01
frameworkgroup: C1[X(C16H20O5)]
method: RPBEPBE
basis: SDD
operation: Freq
keyword: #pfreq=noraman
keyword: PBEPBE/SDD
title: #p freq=noraman PBEPBE/SDD
converged: YES YES NO NO
title: Mulliken charges:
elementType: O O O O O C C C C C C C C C C C C C C C C H H H H H H H H H H H H H H H H H H H H
charge: -0.290774 -0.431646 -0.245140 -0.441379 -0.240113 -0.005056 -0.032130 -0.441634 -0.456367 -0.422939 -0.455398 -0.342118 -0.393603 0.200744 0.222565 -0.456524 -0.331673 0.253716 -0.203826 -0.317966 0.112445 0.216437 0.192658 0.186513 0.222536 0.204208 0.198093 0.187452 0.224894 0.200852 0.199536 0.228604 0.236200 0.213621 0.192100 0.328565 0.307643 0.273869 0.237807 0.280421 0.386807
chargesum: 0.00000
title: Mulliken charges with hydrogens summed into heavy atoms:
elementType: O O O O O C C C C C C C C C C C C C C C C
charge: -0.290774 -0.103081 -0.245140 -0.054572 -0.240113 0.211381 0.160527 -0.032585 -0.054065 -0.010593 -0.055010 0.122685 0.012117 0.200744 0.222565 -0.148882 -0.057804 0.253716 0.033981 -0.037545 0.112445
polarizability: 2.73276910e+02 4.41527453e+00 1.86502897e+02 -5.74015519e+00 1.13142833e+01 1.16727656e+02
1716.lowfreq: -0.0011 -0.0008 -0.0006 1.6869 4.1348 11.9983 17.2871 29.2154 44.1850
frequency: 15.0477 28.8941 43.0564 48.5798 58.8817 72.3312 105.1201 112.7347 136.1421 161.0952 162.5347 187.9092 206.7256 224.4536 230.1581 240.7451 276.5102 310.9899 333.7596 377.2978 385.8565 414.9042 418.7999 439.2220 452.7960 457.8664 480.6992 483.0790 531.7139 578.1822 594.8213 595.7850 659.6062 673.0182 712.8850 742.9210 749.3584 772.5008 788.2826 824.5052 835.1971 854.6233 884.0097 911.9077 914.9311 934.7847 948.6788 963.6017 966.1780 985.0744 990.3195 1005.0918 1012.3547 1029.8342 1036.8180 1064.6147 1075.3592 1083.0617 1089.3860 1093.4170 1114.1191 1128.2162 1136.4474 1160.0838 1170.8240 1182.9726 1203.2773 1220.8111 1235.2171 1248.0255 1264.8677 1283.1979 1288.8216 1293.0533 1313.4767 1315.3103 1322.8459 1328.8464 1340.9888 1348.0356 1356.8266 1365.4111 1374.2607 1375.8145 1396.2903 1436.7947 1459.1577 1460.5129 1466.8266 1467.4185 1468.3398 1471.3046 1475.3835 1583.7152 1612.3236 1622.7409 1650.3209 2925.8069 2944.9244 2956.0735 2958.4400 2960.6552 2966.3833 2974.7403 2992.9775 3018.0972 3028.0715 3043.1058 3046.0105 3059.4528 3060.7729 3148.2412 3164.3748 3175.3373 3184.0563 3533.1675 3556.8214
redmass: 6.4426 6.1557 3.8417 5.7855 9.4099 4.8669 6.3425 3.5186 3.5006 4.7727 4.2894 6.6433 4.1916 2.8474 2.2222 1.9077 6.3038 1.2019 4.8189 6.8632 2.1921 2.9698 3.0808 2.0020 3.0283 3.9240 4.7156 6.0020 5.2329 2.2586 4.0059 1.3868 6.1795 4.0877 2.0486 5.2242 8.1292 3.1616 1.4994 3.1393 1.5899 3.3895 1.6254 1.3372 5.7703 2.5349 2.1358 1.8770 1.4196 1.4714 6.2496 2.1643 1.3697 3.8080 2.9285 1.0940 1.8711 2.3754 1.5308 1.7484 2.6068 2.4166 1.7972 1.8999 1.6931 1.1122 1.3235 1.3863 2.6274 1.1822 1.3455 1.2914 1.2502 1.3047 1.2951 1.2675 2.4158 1.3137 1.4404 1.4058 1.5632 1.5830 1.5669 1.2845 10.3479 3.6795 1.0882 1.0910 1.6035 1.3811 1.1033 1.0889 1.0970 6.8146 7.2213 9.2096 8.9271 1.0809 1.0679 1.0679 1.0611 1.0647 1.0652 1.0765 1.0576 1.0974 1.1028 1.0950 1.0987 1.0967 1.1062 1.0882 1.0924 1.0925 1.0984 1.0642 1.0661
irintensity: 1.0871 1.8640 2.9861 0.5900 0.1266 0.4506 0.1602 1.8317 1.5732 1.8919 0.0133 1.7739 2.0851 3.0859 5.9640 14.3290 12.7255 126.1941 27.0834 2.2568 32.8852 2.2160 2.5907 1.5584 0.7213 12.2426 3.9102 5.9951 11.5257 18.7837 61.2986 101.0012 9.8573 33.4415 91.0284 2.3331 2.7034 2.2798 0.0239 9.5575 18.7680 14.5351 8.4059 21.5672 92.0610 14.6330 84.7259 52.4491 3.2136 12.8503 0.1723 8.5278 0.1058 81.1799 8.2157 1.6255 21.8479 223.3455 27.0429 12.5256 3.4537 53.7999 466.4364 8.5062 7.7912 0.7348 1.4701 28.7111 319.6719 0.1760 3.6261 2.7243 4.6301 12.3881 0.7645 1.3542 36.8945 5.8377 0.1411 2.5098 0.8540 2.0965 3.6499 16.9565 0.4313 8.8260 0.3805 6.6320 2.7476 3.2436 6.3958 27.2646 0.1980 51.4524 57.4484 67.6196 310.7587 21.1290 65.7402 23.7821 25.1848 27.1593 39.9762 34.4236 25.1734 57.8444 42.6656 41.4976 32.2586 33.1099 64.4944 7.9754 2.3037 0.4081 7.3207 50.4589 6.4159
temp: 298.150 k
press: 1.00000 atm
elementType: 8 8 8 8 8 6 6 6 6 6 6 6 6 6 6 6 6 6 6 6 6 1 1 1 1 1 1 1 1 1 1 1 1 1 1 1 1 1 1 1 1
symmnumber: 1
zpe: 875722.7 jmol-1
zpe.correction: 0.333545 hartree
zpe.thermalcorrener: 0.353925 hartree
zpe.thermalcorrenthalpy: 0.354869 hartree
zpe.thermalcorrgfe: 0.282098 hartree
zpe.sumelectzpe: -996.259782 hartree
zpe.sumelectthermal: -996.239402 hartree
zpe.sumelectthermalent: -996.238458 hartree
zpe.sumelectthermalfe: -996.311228 hartree
dipole: -1.7310 1.5475 0.7028
dipole: 2.4259
quadrupole: -118.0851 -133.8516 -121.3089
quadrupole: 32.2074 6.2416 -0.3932
quadrupole: 6.3301 -9.4364 3.1064 32.2074 6.2416 -0.3932
hfenergy: -996.5933268 hartree
pointgroup: C01 [X(C16H20O5)]
dipole: -0.6775942 -0.6066879 -0.2893605 debye
polarizability: 273.2524418|-4.2614873|186.0912493|6.3388567|12.4293516|117.1637714 unknown
InChI: InChI=1S/C16H20O5/c17-9-11-4-6-12(7-5-11)10-21-16(20)14-3-1-2-13(8-14)15(18)19/h1-3,8,11-12,17-18H,4-7,9-10H2
charge 0 multiplicity 1
41 atoms
O  -0.218121 0.560186 -0.094909
O  -7.187217 -1.889414 0.735187
O  1.223423 2.301033 0.473648
O  6.871359 -0.955756 0.044396
O  6.253385 1.222386 0.561193
C  -2.638415 0.745827 -0.351546
C  -5.464903 -0.147019 0.161973
C  -2.964027 -0.395563 0.644153
C  -3.831952 1.73323 -0.451337
C  -4.269024 -1.12576 0.255498
C  -5.143156 1.003472 -0.825925
C  -1.366625 1.50859 0.024725
C  -6.769538 -0.863815 -0.237488
C  1.044823 1.100943 0.150722
C  2.130856 0.088581 -0.024062
C  3.467257 0.503256 0.179713
C  1.854775 -1.255805 -0.388289
C  4.525759 -0.421576 0.018743
C  2.913345 -2.176013 -0.546035
C  4.248337 -1.765589 -0.344923
C  5.918016 0.058394 0.239007
H  -2.479663 0.296683 -1.354903
H  -5.615144 0.306785 1.169193
H  -3.069903 0.036397 1.662526
H  -2.120256 -1.109191 0.685088
H  -3.614557 2.52069 -1.200052
H  -3.965122 2.245642 0.524907
H  -4.134437 -1.617569 -0.731558
H  -4.498326 -1.929237 0.979885
H  -5.980364 1.729325 -0.853394
H  -5.048748 0.583528 -1.84962
H  -1.39777 1.887764 1.064088
H  -1.176862 2.364134 -0.650141
H  -6.628014 -1.426824 -1.177201
H  -7.582779 -0.120836 -0.393656
H  -7.368183 -1.445257 1.60228
H  3.681208 1.539938 0.459931
H  0.816522 -1.561144 -0.544432
H  2.69786 -3.212082 -0.826511
H  5.078365 -2.467086 -0.465313
H  7.77672 -0.576549 0.204836
