program: Gaussian 09
title: 000173880
version: EM64L-G09RevD.01
frameworkgroup: C1[X(C14H14N3)]
method: RPBEPBE
basis: SDD
operation: Freq
keyword: #p
keyword: freq=noraman
keyword: PBEPBE/SDD
title: #p freq=noraman PBEPBE/SDD
converged: NO YES NO NO
title: Mulliken charges:
elementType: N N N C C C C C C C C C C C C C C H H H H H H H H H H H H H H
charge: -0.137945 -0.679808 -0.684638 0.285226 0.287811 0.271178 0.422061 -0.397709 -0.551976 -0.357231 -0.346028 -0.599759 0.567084 -0.621842 0.547585 -0.458798 -0.418908 0.273199 0.257559 0.238025 0.240010 0.240204 0.247924 0.271691 0.271688 0.248625 0.245976 0.339736 0.331606 0.331755 0.335701
chargesum: 1.00000
title: Mulliken charges with hydrogens summed into heavy atoms:
elementType: N N N C C C C C C C C C C C C C C
charge: -0.137945 -0.008467 -0.017182 0.285226 0.287811 0.271178 0.422061 -0.124510 -0.294418 -0.119206 -0.106018 -0.359555 0.567084 0.169461 0.547585 -0.210173 -0.172932
polarizability: 3.56978932e+02 9.17309139e+00 1.90480513e+02 2.47777524e-02 8.03759060e-03 6.98171542e+01
1716.lowfreq: -7.2887 -0.0009 -0.0007 0.0004 6.8474 8.3985 56.6875 92.1427 114.9285
frequency: 56.6866 92.1407 114.9281 159.9123 174.1685 217.9568 259.9002 272.1375 280.6831 313.7575 365.3078 366.0029 407.6124 417.3726 419.2405 429.7846 442.6243 447.9146 508.3065 512.8877 516.6870 526.6910 527.1209 558.6438 593.5204 646.7987 671.9551 687.4587 717.0264 718.5043 765.7632 796.0693 831.5252 839.5181 843.9710 849.4876 916.1361 928.9832 950.4843 966.2162 978.8961 983.6356 1023.9551 1051.4765 1057.0323 1110.2452 1120.3568 1143.7004 1179.1762 1206.0797 1239.3048 1255.9142 1295.8626 1335.7331 1349.2246 1359.1592 1389.3502 1402.1561 1409.6750 1443.3583 1452.4198 1470.6777 1479.0315 1484.9962 1506.6345 1518.5232 1544.8898 1558.9642 1600.8297 1642.9589 1647.5011 1659.1460 1661.1536 3012.8482 3108.2418 3135.8962 3138.4256 3139.9966 3143.6175 3168.7111 3172.4482 3174.0553 3179.6398 3550.0414 3554.4755 3685.0439 3689.3876
redmass: 4.5368 3.5181 3.7006 3.2986 4.4720 1.1937 4.0804 3.1219 3.0968 5.4119 3.3913 3.2168 1.6342 1.2743 3.9575 1.2689 2.7583 4.3355 1.3822 1.7232 6.0694 1.4573 5.6450 4.0317 3.2080 3.6163 5.8635 5.4235 5.9579 2.9129 2.1792 5.6929 1.4878 1.8146 1.6621 1.9250 1.6522 3.9115 2.5118 1.4071 1.3603 6.3855 2.5821 1.8073 1.4863 1.4841 1.3493 2.1258 1.2129 1.8892 1.5322 1.4558 1.6657 2.2989 2.0766 2.9898 2.7309 4.3993 1.8601 2.0299 2.9901 1.0412 5.4855 1.3517 3.5348 2.5909 4.2709 6.8820 5.0449 3.2049 2.8374 1.4476 1.4808 1.0346 1.1033 1.0911 1.0902 1.1019 1.0899 1.0965 1.0933 1.0910 1.0937 1.0462 1.0462 1.1040 1.1040
irintensity: 3.2560 1.0370 3.7914 3.5597 4.2733 0.5353 2.3393 0.7777 2.4852 1.9321 0.0721 0.1282 0.6175 14.6326 5.0888 6.5690 23.5960 0.5399 129.5933 250.7072 5.0435 205.7786 0.4408 2.5369 0.0700 2.2463 1.1882 7.0168 0.7011 10.6538 0.8035 5.2741 31.5577 18.5066 39.2502 44.1145 42.1187 3.5440 2.2029 0.0879 0.0769 10.5085 0.1897 10.2660 1.1132 15.4327 0.8810 17.4339 19.9532 3.2953 10.2219 70.4708 15.1752 51.4524 61.2215 35.2944 13.0515 42.6438 8.0246 24.2487 33.1832 22.7202 25.4833 23.3008 408.8352 41.6665 0.9236 5.9127 58.8057 66.0453 100.3643 897.3237 4.3311 11.6741 5.0505 4.1914 14.6969 3.1852 3.6582 1.0570 0.3839 9.0466 7.8858 306.6062 158.5889 36.0638 35.6024
temp: 298.150 k
press: 1.00000 atm
elementType: 7 7 7 6 6 6 6 6 6 6 6 6 6 6 6 6 6 1 1 1 1 1 1 1 1 1 1 1 1 1 1
symmnumber: 1
zpe: 667078.0 jmol-1
zpe.correction: 0.254077 hartree
zpe.thermalcorrener: 0.268156 hartree
zpe.thermalcorrenthalpy: 0.269100 hartree
zpe.thermalcorrgfe: 0.214410 hartree
zpe.sumelectzpe: -704.791083 hartree
zpe.sumelectthermal: -704.777004 hartree
zpe.sumelectthermalent: -704.776060 hartree
zpe.sumelectthermalfe: -704.830749 hartree
dipole: -0.8305 2.2036 -0.0001
dipole: 2.3549
quadrupole: -10.8217 -60.4773 -105.2207
quadrupole: -0.7800 0.0113 0.0032
quadrupole: 48.0182 -1.6374 -46.3808 -0.7800 0.0113 0.0032
hfenergy: -705.0451597 hartree
pointgroup: C01 [X(C14H14N3)]
dipole: -0.3189295 0.869865 -0.0000556 debye
polarizability: 357.1304154|7.6746953|190.32903|0.024849|0.0078145|69.8171542 unknown
InChI: InChI=1S/C14H14N3/c1-17-8-9-6-10(15)2-4-12(9)13-5-3-11(16)7-14(13)17/h2-8H,15-16H2,1H3
charge 1 multiplicity 1
31 atoms
N  -0.695567 1.870485 0.00006
N  -4.877619 -0.686667 -0.000557
N  5.098854 -0.185804 0.000244
C  -0.611067 -0.58298 -0.000112
C  0.832077 -0.526604 0.00002
C  -1.392191 0.633182 -0.000121
C  1.481693 0.76942 0.000131
C  0.661827 1.925764 0.000161
C  -2.807949 0.607839 -0.000315
C  -1.343971 -1.813888 -0.000264
C  1.684044 -1.67518 0.000051
C  2.903253 0.895941 0.000238
C  -3.499336 -0.628769 -0.000456
C  -1.466403 3.1426 0.000119
C  3.719213 -0.254307 0.000225
C  -2.731806 -1.847664 -0.000424
C  3.069798 -1.546155 0.000147
H  1.107353 2.923943 0.0003
H  -3.386898 1.534108 -0.000356
H  -0.801212 -2.76261 -0.000265
H  1.25681 -2.681315 -0.000007
H  3.354421 1.894835 0.000321
H  -0.7679 3.991246 0.000424
H  -2.099294 3.202444 -0.900721
H  -2.099682 3.202117 0.900704
H  -3.254393 -2.810622 -0.000537
H  3.692587 -2.448664 0.000164
H  -5.36346 -1.580723 -0.00078
H  -5.447099 0.156531 -0.000655
H  5.584311 0.70807 0.000325
H  5.667406 -1.029173 0.000336
