program: Gaussian 09
title: 000173887
version: EM64L-G09RevD.01
frameworkgroup: C1[X(C19H18)]
method: RPBEPBE
basis: SDD
operation: Freq
keyword: #p
keyword: freq=noraman
keyword: PBEPBE/SDD
title: #p freq=noraman PBEPBE/SDD
converged: YES YES NO NO
title: Mulliken charges:
elementType: C C C C C C C C C C C C C C C C C C C H H H H H H H H H H H H H H H H H H
charge: 0.041410 0.102663 -0.532549 -0.541634 -0.458311 0.250953 0.134470 0.116483 0.158430 0.151295 -0.451290 -0.857683 0.415717 -0.887901 -0.506211 -0.361222 -0.454502 -0.271570 -0.256930 0.222044 0.227653 0.225878 0.219697 0.222832 0.217439 0.243305 0.235005 0.236377 0.243457 0.263425 0.224061 0.243212 0.234898 0.257065 0.239375 0.224947 0.227712
chargesum: 0.00000
title: Mulliken charges with hydrogens summed into heavy atoms:
elementType: C C C C C C C C C C C C C C C C C C C
charge: 0.041410 0.102663 -0.082852 -0.096059 -0.018041 0.250953 0.134470 0.116483 0.158430 0.151295 -0.207985 -0.142844 0.415717 -0.157204 -0.271313 -0.104157 -0.215127 -0.046623 -0.029218
polarizability: 3.29895437e+02 3.35401337e+00 2.24111603e+02 -3.02811381e+00 8.14763959e+00 1.01948065e+02
1716.lowfreq: -6.3295 -0.0003 -0.0001 0.0004 4.9312 10.8621 54.4845 78.4247 100.6817
frequency: 54.4695 78.4081 100.6713 140.1969 146.9603 163.9749 195.1620 201.8662 225.2001 272.7620 285.0539 298.3189 328.6792 351.6824 377.3740 392.5543 431.8644 441.5808 477.0054 502.9087 531.4479 543.8238 562.8804 602.7427 612.5706 623.3879 637.6680 651.3493 714.8516 732.8045 759.8032 801.5094 813.1646 819.2127 834.8373 848.1405 881.5720 892.8253 914.2332 926.8321 954.8603 959.2819 976.7897 987.3221 1011.4711 1015.5184 1022.5907 1036.8743 1044.6875 1050.5035 1071.2751 1078.1534 1113.7446 1132.1186 1153.5477 1172.9251 1181.7487 1189.8054 1211.7424 1233.4990 1255.5802 1278.6999 1281.0962 1297.9012 1315.3261 1326.6098 1363.0241 1391.2537 1393.0602 1394.7292 1401.7782 1405.4493 1420.0311 1447.0172 1459.1137 1463.6412 1470.6445 1471.8606 1479.5825 1490.7192 1501.5495 1503.5207 1531.8078 1572.9762 1594.4361 1617.6771 1626.8706 2964.7676 2965.5444 2966.7935 2968.6348 3003.1479 3029.2899 3034.7450 3044.0757 3056.1980 3074.3468 3091.3721 3096.8431 3118.4128 3122.0094 3132.3795 3149.7844 3156.6984 3205.8845
redmass: 4.0628 3.2032 2.5391 2.6199 2.3303 1.1738 3.0996 2.5890 3.2246 3.7825 1.4550 2.7789 3.7731 3.5669 4.5056 2.3543 4.2021 3.1144 4.5971 3.5793 5.5043 3.2351 4.0483 3.3244 3.4997 3.8085 4.3500 2.7988 3.4952 2.8009 1.2975 3.4400 3.1641 3.4270 1.8124 2.4328 1.6238 1.6777 3.1274 2.3686 1.3898 3.8044 1.3696 1.3510 1.4252 1.7680 2.1850 1.6512 2.2005 1.7553 2.3143 2.8552 2.3932 1.2249 1.5742 1.3391 1.3096 1.4091 1.2503 2.0190 1.7109 1.5534 1.4002 1.9350 2.3697 2.3896 4.3877 6.9314 1.2435 4.9075 3.6299 1.2404 2.4411 2.2904 1.0994 1.1010 1.1609 1.1175 1.1034 1.0881 1.3541 2.0237 4.4164 7.2495 7.4362 6.4087 6.9481 1.0641 1.0485 1.0621 1.0427 1.0672 1.0955 1.0915 1.0931 1.0876 1.1042 1.0974 1.0981 1.0867 1.0862 1.0904 1.0977 1.0987 1.0917
irintensity: 0.2626 0.1431 0.9128 0.2179 0.4999 1.3658 0.6145 5.8806 0.6037 0.1634 0.2860 1.0246 0.3932 0.5588 0.4274 3.6046 2.3344 1.0232 0.9196 1.3284 0.6718 4.3261 2.9993 6.1962 0.3715 1.1648 0.8927 6.4822 1.2548 7.4271 52.2952 2.0866 2.4814 8.8842 46.5156 2.2479 8.9414 4.5325 5.3037 1.1745 3.1910 1.8042 1.3906 0.9781 3.8253 13.6369 0.5941 0.4845 3.3114 2.0525 4.6857 0.4102 0.7282 1.1286 1.9408 4.5814 0.3052 1.8703 5.0211 2.5482 11.5479 4.5705 0.2439 4.6679 1.9580 3.3246 6.4711 1.0633 2.2785 3.3947 1.7030 15.7195 5.6079 15.1972 5.3242 4.4452 31.0682 7.5985 3.0150 10.9478 12.4398 3.6766 4.2196 1.9042 5.4487 0.9503 0.7694 51.1773 17.5682 39.9643 45.7028 38.1663 27.2468 47.9454 27.5040 17.4343 55.9602 28.6114 8.2900 1.4203 4.2302 17.7484 28.7024 44.3977 11.7014
temp: 298.150 k
press: 1.00000 atm
elementType: 6 6 6 6 6 6 6 6 6 6 6 6 6 6 6 6 6 6 6 1 1 1 1 1 1 1 1 1 1 1 1 1 1 1 1 1 1
symmnumber: 1
zpe: 811712.3 jmol-1
zpe.correction: 0.309165 hartree
zpe.thermalcorrener: 0.324574 hartree
zpe.thermalcorrenthalpy: 0.325518 hartree
zpe.thermalcorrgfe: 0.267608 hartree
zpe.sumelectzpe: -733.530033 hartree
zpe.sumelectthermal: -733.514624 hartree
zpe.sumelectthermalent: -733.513679 hartree
zpe.sumelectthermalfe: -733.571589 hartree
dipole: 1.3084 0.4550 -0.0507
dipole: 1.3862
quadrupole: -99.6055 -100.0118 -116.9165
quadrupole: 0.1110 -0.9251 1.6851
quadrupole: 5.9058 5.4995 -11.4052 0.1110 -0.9251 1.6851
hfenergy: -733.8391974 hartree
pointgroup: C01 [X(C19H18)]
dipole: -0.51539 0.1773791 0.0182546 debye
polarizability: 329.9105265|-3.0231237|223.8535686|-3.2442761|-9.7549006|102.1910094 unknown
InChI: InChI=1S/C19H18/c1-12-13(2)19-16-7-4-3-6-14(16)10-11-18(19)17-9-5-8-15(12)17/h3-4,6-7,10-11H,5,8-9H2,1-2H3
charge 0 multiplicity 1
37 atoms
C  -1.894253 -0.910525 0.015293
C  -2.595859 0.301076 -0.059145
C  -2.853731 -2.094972 0.027934
C  -4.098391 0.047651 -0.135584
C  -4.189811 -1.471023 -0.481958
C  -0.474536 -0.928946 0.09687
C  -1.912264 1.545508 0.037476
C  0.260109 0.322793 0.047317
C  -0.489729 1.560825 0.118263
C  1.731222 0.233914 -0.053295
C  0.221378 -2.184313 0.27087
C  -2.717593 2.836446 0.084158
C  2.383933 -1.04043 0.171442
C  0.168624 2.908712 0.394726
C  1.595275 -2.234128 0.366476
C  2.57896 1.320498 -0.448759
C  3.808809 -1.141284 0.129205
C  3.975224 1.194915 -0.513365
C  4.60656 -0.036961 -0.189592
H  -2.520513 -2.937282 -0.605976
H  -2.966607 -2.492679 1.057955
H  -4.578598 0.265959 0.84073
H  -4.610731 0.675154 -0.888282
H  -4.250032 -1.590098 -1.579662
H  -5.080448 -1.954322 -0.043893
H  -0.372327 -3.100887 0.353036
H  -2.71402 3.286343 1.097193
H  -2.317457 3.600451 -0.606987
H  -3.770507 2.656335 -0.186209
H  1.097138 2.796959 0.976491
H  0.412875 3.471892 -0.528704
H  -0.51042 3.55049 0.980859
H  2.115032 -3.184031 0.538595
H  2.138784 2.266294 -0.762715
H  4.268423 -2.117485 0.326251
H  4.579732 2.05234 -0.830047
H  5.69775 -0.126687 -0.223665
