program: Gaussian 09
title: 000173854
version: EM64L-G09RevD.01
frameworkgroup: C1[X(C7H14N2Si)]
method: RPBEPBE
basis: SDD
operation: Freq
keyword: #p
keyword: freq=noraman
keyword: PBEPBE/SDD
title: #p freq=noraman PBEPBE/SDD
converged: YES YES NO NO
title: Mulliken charges:
elementType: Si N N C C C C C C C H H H H H H H H H H H H H H
charge: 1.388024 -0.531225 -0.103804 -0.729203 -1.053986 -1.008327 -0.661796 -0.160773 -0.177189 -0.333416 0.232341 0.228857 0.250564 0.248628 0.252513 0.252081 0.237732 0.242107 0.223898 0.212614 0.239695 0.249553 0.253054 0.248057
chargesum: 0.00000
title: Mulliken charges with hydrogens summed into heavy atoms:
elementType: Si N N C C C C C C C
charge: 1.388024 -0.531225 -0.103804 -0.268004 -0.302280 -0.276407 0.014411 0.088780 0.075864 -0.085359
polarizability: 1.22009693e+02 5.10176166e+00 9.06225929e+01 -2.87320275e-01 -9.07183116e-01 1.06324659e+02
1716.lowfreq: -0.0010 -0.0009 0.0016 2.6234 13.0327 19.4727 22.0955 52.7763 90.7934
frequency: 19.3919 52.3287 90.7734 121.0856 125.3805 144.7727 152.1381 181.6598 191.9572 229.9357 238.7900 298.8265 352.6118 409.2416 601.1244 630.9227 655.2192 675.7393 709.4231 719.3836 729.5802 779.0526 812.6754 822.3241 843.5803 877.0482 883.5110 907.4192 974.0997 992.8364 994.5655 1029.8269 1049.1777 1106.0347 1151.0146 1210.7975 1237.0200 1244.5081 1251.4603 1303.8820 1312.5597 1318.0926 1396.6068 1421.9685 1436.3015 1444.3363 1445.9110 1453.1540 1458.5645 1463.5379 1483.9610 1487.7603 2973.9108 2978.3391 2986.2435 2988.7969 3027.4088 3069.2422 3078.0639 3087.1846 3088.6640 3095.0725 3096.5601 3213.4196 3232.9676 3244.6067
redmass: 3.7419 2.8568 2.3368 1.0810 2.5921 2.0331 1.2347 1.7526 2.4152 2.7614 1.6194 3.5028 3.5524 5.2565 3.5299 3.0649 3.3191 2.3992 2.2100 1.6160 1.2954 1.4019 1.2438 1.7206 1.4009 1.6253 3.9053 1.5043 2.4150 1.4279 1.8547 2.5094 1.6247 1.7154 4.9725 3.2948 1.2303 1.5427 1.4274 1.2041 1.2105 3.8321 1.1823 2.8008 1.0735 1.0638 1.0565 1.0513 1.0703 3.8513 1.0458 1.0417 1.0559 1.0384 1.0348 1.0350 1.0993 1.0999 1.1003 1.0978 1.0974 1.0986 1.0986 1.0904 1.0962 1.1094
irintensity: 1.4280 0.5470 0.3147 0.2262 1.1962 0.9980 0.3665 0.1649 0.3189 2.0227 0.3633 2.0492 6.9689 19.8759 17.1300 3.5864 21.2722 6.0611 16.5819 15.2057 39.2023 53.5807 2.4734 65.4387 2.9590 134.2504 7.7806 112.4753 0.9848 20.1464 26.8727 22.1008 65.8428 10.9051 114.5212 19.8382 5.6009 2.0814 5.5368 54.4029 28.0599 0.5247 8.9569 49.8062 4.3651 10.8280 1.1964 7.3568 23.1755 8.8912 7.7048 9.5234 28.1836 25.7747 10.8321 5.8707 8.7957 40.1353 35.0787 5.6169 25.3692 10.6764 13.5436 1.3205 6.4945 4.5670
temp: 298.150 k
press: 1.00000 atm
elementType: 14 7 7 6 6 6 6 6 6 6 1 1 1 1 1 1 1 1 1 1 1 1 1 1
symmnumber: 1
zpe: 520880.1 jmol-1
zpe.correction: 0.198393 hartree
zpe.thermalcorrener: 0.211360 hartree
zpe.thermalcorrenthalpy: 0.212305 hartree
zpe.thermalcorrgfe: 0.158092 hartree
zpe.sumelectzpe: -673.281194 hartree
zpe.sumelectthermal: -673.268227 hartree
zpe.sumelectthermalent: -673.267282 hartree
zpe.sumelectthermalfe: -673.321495 hartree
dipole: -5.0207 -0.6179 -1.3442
dipole: 5.2342
quadrupole: -79.4630 -70.0383 -65.9686
quadrupole: 0.3091 -6.3918 -1.3179
quadrupole: -7.6397 1.7850 5.8547 0.3091 -6.3918 -1.3179
hfenergy: -673.479587 hartree
pointgroup: C01 [X(C7H14N2Si1)]
dipole: -1.9543316 -0.3037478 -0.5735642 debye
dipolederiv: 1.8724095 0.0961002 0.0041209 0.1531463 1.4281248 0.1091943 -0.0044784 0.0590638 1.233978 -1.302957 -0.2228532 -0.0827068 -0.2573707 -0.4259458 -0.0317624 -0.0668296 -0.0098017 -0.3543765 -0.66212 -0.0828328 -0.0720182 -0.1277817 -0.2676636 -0.0041395 -0.0165406 0.0097906 -0.2696838 -0.2404455 -0.0246906 -0.0360275 0.0307605 -0.3159269 -0.0422097 -0.0172637 -0.0778676 -0.2706806 -0.3476452 -0.0077425 0.0306462 -0.0366458 -0.369818 0.0572476 0.0573678 0.0770892 -0.4222744 -0.3635334 0.0198179 0.008703 -0.0153717 -0.3980893 -0.1082618 -0.0324656 -0.0918709 -0.4049285 0.0339405 0.0727291 0.0323715 -0.0095581 -0.0035078 -0.0813626 -0.051633 0.0414404 0.0682986 0.2304876 0.10415 0.0409098 0.2581804 -0.1059168 -0.0223231 -0.2746356 -0.1104639 -0.0906726 0.5929975 0.1426208 0.1545554 0.0538695 -0.0927458 -0.0661087 0.4282195 -0.0007907 0.1153768 -0.0044252 0.093161 -0.063145 0.0894151 -0.1131293 -0.1243281 -0.0651959 -0.1198618 0.0483374 0.1029988 -0.0178721 0.0425537 -0.0249517 -0.0022696 0.0918073 0.0469215 0.0460695 -0.1149508 -0.1775804 -0.0667795 -0.0499015 -0.0002728 0.0675443 -0.0318503 -0.0168646 -0.0422851 0.0724326 0.1131504 -0.0022614 -0.0336496 -0.0127162 0.0605533 -0.086777 -0.03165 -0.1251789 -0.0618892 -0.1113032 -0.0757571 0.0188825 -0.0792226 0.0896433 0.0007483 0.0354476 0.0025542 0.1179187 0.0607833 0.1000825 -0.0315073 0.1125065 -0.0524171 0.0220782 -0.0397882 0.0608314 0.0932451 0.0547932 0.0987941 -0.0005404 0.1155735 -0.0729782 -0.00322 0.019013 -0.024525 0.0938883 -0.1109078 -0.0779096 -0.0418413 -0.104843 0.0772593 -0.0167478 -0.0700967 -0.0180452 0.1036848 0.1017232 -0.0185328 0.0589533 -0.0132015 0.0739623 0.0743812 0.0623291 0.0868314 -0.0769022 0.0194743 0.1294121 -0.0110276 0.1378921 -0.1622316 -0.0250722 -0.020352 -0.0047095 0.0640429 0.0745195 -0.0334606 0.0553842 -0.0566102 0.0520763 0.1006332 0.0662343 0.0476351 -0.1180407 -0.1061789 -0.0884984 -0.0368596 -0.0666213 0.0852663 -0.0136288 -0.0192016 -0.0103906 0.0652558 0.0760951 0.0033049 -0.1134715 -0.0192644 0.1810397 0.0492087 -0.0662549 0.0639264 0.0097266 0.0875842 -0.0524331 0.0528302 -0.0485371 0.1278044 0.0790954 0.0375026 0.0769016 0.0239168 0.0061398 -0.0885486 0.0727857 -0.0783751 0.1393657 0.0733978 0.0402149 0.0636573 0.0742969 unknown
polarizability: 120.4231295|8.2764453|94.251502|1.8973132|-5.1741831|104.2823136 unknown
InChI: InChI=1S/C7H14N2Si/c1-4-10(2,3)9-6-5-8-7-9/h5-7H,4H2,1-3H3
charge 0 multiplicity 1
24 atoms
Si -1.246379 -0.589072 -0.158327
N  0.524491 -0.100955 -0.05202
N  2.638317 0.224048 0.76504
C  -2.256285 1.02335 -0.371622
C  -1.646501 -1.483595 1.472439
C  -1.429461 -1.734309 -1.668555
C  -2.060515 2.043177 0.779811
C  1.268898 0.559974 -1.050968
C  1.411606 -0.273141 1.020357
C  2.552687 0.749233 -0.536436
H  -1.972736 1.487951 -1.337501
H  -3.328089 0.753387 -0.466714
H  -1.486321 -0.829766 2.34816
H  -2.706219 -1.798434 1.478512
H  -1.027225 -2.38971 1.598236
H  -0.793348 -2.630755 -1.559734
H  -2.477091 -2.06781 -1.786595
H  -1.132528 -1.219034 -2.599935
H  -2.639559 2.966867 0.597098
H  -2.394063 1.629896 1.750055
H  -0.997519 2.327922 0.883179
H  0.838204 0.828305 -2.013349
H  1.124123 -0.760586 1.948975
H  3.410714 1.221658 -1.009905
