program: Gaussian 09
title: 000174013
version: EM64L-G09RevD.01
frameworkgroup: C1[X(C20H34O6)]
method: RPBEPBE
basis: SDD
operation: Freq
keyword: #pfreq=noraman
keyword: PBEPBE/SDD
title: #p freq=noraman PBEPBE/SDD
converged: YES YES NO NO
title: Mulliken charges:
elementType: O O O O O O C C C C C C C C C C C C C C C C C C C C H H H H H H H H H H H H H H H H H H H H H H H H H H H H H H H H H H
charge: -0.470315 -0.465726 -0.226763 -0.212142 -0.415999 -0.259244 -0.078924 -0.093878 -0.177587 -0.147430 -0.536233 -0.492574 -0.618770 -0.528070 0.223873 -0.520690 0.209047 -0.503016 -0.404226 -0.393680 -0.367137 -0.317635 -0.492883 -0.360498 -0.702337 0.193356 0.256317 0.242154 0.222686 0.272237 0.250401 0.207885 0.235862 0.215076 0.262894 0.284201 0.219920 0.231852 0.350106 0.348987 0.234828 0.229783 0.226610 0.260967 0.212357 0.232024 0.226313 0.203755 0.215796 0.232917 0.157671 0.182146 0.247053 0.261267 0.200383 0.203908 0.211124 0.225738 0.205918 0.388339
chargesum: 0.00000
title: Mulliken charges with hydrogens summed into heavy atoms:
elementType: O O O O O O C C C C C C C C C C C C C C C C C C C C
charge: -0.120209 -0.116739 -0.226763 -0.212142 -0.027660 -0.259244 0.177393 0.148276 0.045100 0.124808 -0.077947 -0.041636 -0.071675 -0.076297 0.223873 -0.056079 0.209047 -0.015439 0.040155 0.036389 0.081577 0.022182 0.015438 0.043793 -0.059557 0.193356
polarizability: 2.55903146e+02 -5.20681779e+00 2.46663795e+02 -8.36026816e+00 -1.58722249e+00 1.87005047e+02
1716.lowfreq: -7.7571 -0.0008 -0.0006 -0.0005 5.5688 7.2093 15.2953 22.7435 24.0967
frequency: 14.8506 22.3600 23.9400 38.4676 41.6993 43.3287 49.6181 51.8309 58.6101 63.3821 69.8190 74.4642 87.1076 103.8504 115.3867 126.0250 134.5058 142.5957 190.4856 199.0992 216.0279 222.0503 224.6443 232.1610 249.0183 257.8007 276.9914 279.5313 318.3003 326.9515 342.9405 364.7846 381.9241 393.3372 417.5603 427.3804 440.4543 465.7714 483.4124 506.2852 513.5251 530.0204 552.0532 586.5959 596.2636 602.6687 661.1759 663.7442 669.7316 723.1369 733.6103 743.8698 754.0437 788.1549 793.6211 798.5139 810.5408 819.9771 827.8970 844.6178 850.3767 867.0179 882.4323 897.2136 899.9647 930.3655 947.7763 956.2316 965.7731 975.8152 990.8948 1008.1310 1024.3057 1035.7706 1040.9868 1045.5403 1062.6847 1066.7316 1071.8931 1076.5317 1077.1605 1087.3258 1092.7207 1109.5557 1122.0777 1129.2697 1138.7575 1149.1028 1165.9174 1177.3828 1188.2752 1198.1913 1202.6033 1205.1874 1210.4627 1217.5042 1232.1342 1240.1978 1243.8526 1256.5208 1262.9983 1264.5358 1281.1680 1286.8340 1293.1752 1298.1159 1301.7952 1302.6670 1309.3577 1311.7886 1317.5045 1322.8900 1328.2758 1331.0663 1346.2157 1349.5672 1360.0296 1360.6955 1366.1244 1368.5330 1369.4189 1389.1432 1418.4854 1422.1969 1426.0428 1433.7503 1444.7071 1445.3904 1445.9503 1463.3365 1467.0307 1469.8621 1472.4718 1478.0290 1479.5417 1480.7730 1489.7070 1617.7831 1619.2627 1644.6052 2912.2523 2957.2819 2962.5623 2966.1322 2966.6782 2969.6446 2975.6789 2976.9254 2977.2089 2979.2347 2989.6595 2991.4428 2993.2729 2995.4990 2997.5375 3000.7514 3007.9473 3017.0877 3019.4731 3024.7221 3027.6994 3032.4451 3049.4061 3055.2000 3058.6414 3059.1196 3062.8003 3066.7129 3067.5024 3072.0323 3085.4703 3373.3595 3463.3052 3563.8033
redmass: 5.2770 4.9407 5.0530 3.9849 6.2960 7.1517 3.5737 5.2223 5.5372 4.1041 3.3412 2.8071 4.0732 4.8305 1.7244 3.8302 2.3921 3.3686 4.4953 3.2219 3.4148 1.9014 1.6664 2.4895 3.0500 3.2421 2.5144 3.8681 1.2308 2.6569 2.4801 3.8843 2.6011 2.6655 3.3176 2.3735 2.5405 2.9727 3.6480 2.0834 3.2872 3.8623 3.0411 2.5634 3.1487 2.7808 1.4698 2.3503 1.1024 1.3181 1.6470 1.2141 2.6108 2.7367 2.3639 4.0094 1.9087 3.1381 2.5841 1.8806 2.0294 2.3089 1.8739 2.0978 1.8177 2.2212 1.4872 2.1213 1.9433 1.8386 2.3078 3.1965 2.0387 1.8473 3.1664 2.1629 2.3983 1.6102 2.5576 2.3582 2.1932 2.1062 1.6377 1.8695 2.6506 1.7591 1.5447 1.7152 1.3946 1.4173 1.3431 1.4975 1.3603 1.3178 1.4761 1.5069 1.3667 1.4047 1.4004 1.3142 1.5139 1.4387 1.0450 1.2610 1.1357 1.3942 1.4167 1.3924 1.3768 1.4565 1.3554 1.2247 1.3243 1.3711 1.5741 1.4994 1.7164 1.7380 1.8450 1.5118 1.5112 1.2194 1.1663 1.1046 1.1016 1.0902 1.0837 1.0936 1.0943 1.0769 1.0783 1.0592 1.0814 1.0498 1.0902 1.0602 1.0933 8.2043 8.4588 7.5999 1.0603 1.0621 1.0627 1.0577 1.0414 1.0947 1.0605 1.0630 1.0663 1.0789 1.0615 1.0637 1.0623 1.0660 1.0815 1.0623 1.0940 1.0852 1.0947 1.1017 1.0995 1.0985 1.0986 1.1019 1.0954 1.0995 1.1015 1.1018 1.1010 1.0984 1.0896 1.0663 1.0641 1.0661
irintensity: 0.9781 2.6187 0.3795 3.4686 1.3558 1.7447 1.2915 0.7850 1.8390 0.7194 1.8675 0.2771 2.6536 2.0750 0.0588 4.6312 0.6095 2.1069 7.5866 3.2513 0.2488 1.6337 1.1504 2.4863 5.3864 10.6721 2.2198 0.2818 78.6877 15.4587 18.1021 9.2382 1.3679 1.4333 8.3691 8.0280 2.6715 7.0646 23.8708 12.7083 6.4993 8.0069 10.2442 0.9588 1.9806 6.0709 81.9218 38.4507 112.8408 2.3497 19.1764 2.4355 2.8256 3.3574 3.9193 4.2305 1.7098 23.9086 2.2567 16.0038 8.9799 2.9916 5.1512 6.0139 5.0814 43.0307 2.5524 18.7905 12.8133 24.4655 21.6302 2.5813 12.0625 8.0102 119.8910 21.0870 11.2854 79.1489 77.3434 20.4436 2.9553 18.4507 11.9127 0.4481 7.7800 11.1822 21.8110 18.3382 15.1756 13.7716 11.4889 0.5751 2.8093 42.4004 8.7381 9.2094 2.2165 34.5328 26.4093 2.0969 10.6249 6.8854 0.8410 7.3346 6.3301 15.0839 7.1877 6.8349 7.5610 24.1508 10.8797 1.5992 6.5067 8.6191 2.9942 1.3383 38.4478 22.2884 64.8449 1.8029 1.7257 10.6741 63.5982 28.6260 46.2645 40.3380 24.8392 9.6738 13.2104 4.8412 2.8545 1.9511 4.8920 11.6816 8.1026 8.3221 19.5395 128.9363 100.6179 236.2301 77.5081 7.2414 24.2783 18.7405 23.0495 14.6566 32.9473 16.2480 11.5120 16.5641 17.6676 46.3415 29.8524 10.6114 22.3984 19.7695 8.1300 48.3845 18.3864 6.7252 30.3361 2.6229 4.3392 5.1364 43.4651 11.0098 119.9951 31.3163 71.6231 58.7909 27.3699 90.8901 131.7408 5.5229
temp: 298.150 k
press: 1.00000 atm
elementType: 8 8 8 8 8 8 6 6 6 6 6 6 6 6 6 6 6 6 6 6 6 6 6 6 6 6 1 1 1 1 1 1 1 1 1 1 1 1 1 1 1 1 1 1 1 1 1 1 1 1 1 1 1 1 1 1 1 1 1 1
symmnumber: 1
zpe: 1346351.9 jmol-1
zpe.correction: 0.512798 hartree
zpe.thermalcorrener: 0.542684 hartree
zpe.thermalcorrenthalpy: 0.543628 hartree
zpe.thermalcorrgfe: 0.447887 hartree
zpe.sumelectzpe: -1231.796797 hartree
zpe.sumelectthermal: -1231.766912 hartree
zpe.sumelectthermalent: -1231.765968 hartree
zpe.sumelectthermalfe: -1231.861709 hartree
dipole: -2.9899 0.7131 -1.7242
dipole: 3.5243
quadrupole: -159.7417 -160.9929 -157.7176
quadrupole: -22.0983 -1.0210 7.7498
quadrupole: -0.2576 -1.5088 1.7665 -22.0983 -1.0210 7.7498
hfenergy: -1232.3095955 hartree
pointgroup: C01 [X(C20H34O6)]
dipole: -1.1898541 -0.2388407 -0.6706371 debye
polarizability: 258.1081399|0.2969714|244.4461385|-7.5332761|-4.2636235|187.0177096 unknown
InChI: InChI=1S/C20H34O6/c1-2-3-4-7-14(21)10-11-16-17(19(24)13-18(16)23)12-15(22)8-5-6-9-20(25)26/h16-19,23-25H,2-13H2,1H3
charge 0 multiplicity 1
60 atoms
O  3.796087 -1.206254 1.493189
O  3.594958 1.578655 1.892494
O  1.6396 3.919101 -0.7390
O  1.092835 -4.094906 0.044468
O  -4.343796 0.44678 -0.324987
O  -2.052443 0.601107 -0.626329
C  2.340691 -0.369318 -0.267997
C  2.338503 1.200348 -0.258794
C  3.808167 -0.781133 0.056411
C  3.682131 1.603696 0.421695
C  4.645797 0.511128 -0.097936
C  1.79964 -0.933436 -1.6047
C  1.100245 1.823543 0.400222
C  1.687344 -2.480829 -1.674632
C  0.952003 3.322857 0.136616
C  -0.070351 4.084622 0.987208
C  0.72107 -3.126798 -0.674444
C  -0.707582 -2.583693 -0.613912
C  -1.491402 3.459944 0.961956
C  -1.676602 -3.481956 0.179738
C  -2.128518 3.496385 -0.447604
C  -3.072311 -2.844334 0.356958
C  -3.424174 2.666255 -0.547316
C  -4.075456 -3.744106 1.113173
C  -5.461411 -3.084836 1.282677
C  -3.163725 1.170811 -0.50459
H  1.717669 -0.75546 0.563175
H  2.39541 1.56731 -1.304223
H  4.17363 -1.622643 -0.562159
H  3.980785 2.631233 0.164811
H  5.600564 0.48137 0.456748
H  4.872268 0.687994 -1.167473
H  0.808246 -0.477798 -1.79726
H  2.454897 -0.596371 -2.433785
H  1.138564 1.660882 1.495958
H  0.174777 1.32755 0.03698
H  1.336003 -2.753501 -2.692645
H  2.67282 -2.959831 -1.533236
H  4.674355 -1.60101 1.72635
H  3.580962 0.613892 2.159602
H  0.302162 4.09214 2.032156
H  -0.096882 5.1309 0.631642
H  -1.071182 -2.419012 -1.649698
H  -0.680068 -1.566839 -0.16923
H  -2.137247 4.00991 1.674626
H  -1.440393 2.415485 1.322992
H  -1.235278 -3.701023 1.170046
H  -1.773782 -4.460706 -0.3300
H  -2.348411 4.545261 -0.723886
H  -1.404517 3.118887 -1.194147
H  -3.491902 -2.601198 -0.646739
H  -2.956351 -1.886812 0.910429
H  -4.138743 2.91683 0.259094
H  -3.956324 2.874171 -1.497145
H  -4.183111 -4.705162 0.571411
H  -3.657536 -3.993405 2.109003
H  -5.38571 -2.134618 1.845901
H  -6.158677 -3.74293 1.832189
H  -5.92049 -2.86106 0.300032
H  -4.144402 -0.53157 -0.306684
