program: Gaussian 09
title: 000173884
version: EM64L-G09RevD.01
frameworkgroup: C1[X(C17H24N4O2)]
method: RPBEPBE
basis: SDD
operation: Freq
keyword: #p
keyword: freq=noraman
keyword: PBEPBE/SDD
title: #p freq=noraman PBEPBE/SDD
converged: YES YES NO NO
title: Mulliken charges:
elementType: O O N N N N C C C C C C C C C C C C C C C C C H H H H H H H H H H H H H H H H H H H H H H H H
charge: -0.276403 -0.285007 -0.131006 -0.252246 -0.393434 -0.585257 -0.409165 -0.028752 -0.241117 0.033363 0.350157 0.157563 -0.702225 -0.709731 0.053510 0.453385 -0.799727 -0.652353 -0.360206 -0.384191 -0.214069 -0.210425 -0.249638 0.217810 0.188213 0.217559 0.233706 0.210385 0.220862 0.203845 0.214285 0.216549 0.203301 0.345010 0.257869 0.301532 0.234580 0.335407 0.231684 0.254790 0.269453 0.241651 0.282607 0.264436 0.230417 0.229263 0.231760
chargesum: 0.00000
title: Mulliken charges with hydrogens summed into heavy atoms:
elementType: O O N N N N C C C C C C C C C C C C C C C C C
charge: -0.276403 -0.285007 -0.131006 -0.252246 -0.048425 -0.025856 -0.003142 0.188807 -0.007411 0.033363 0.350157 0.157563 -0.067132 -0.075595 0.053510 0.453385 0.001944 0.113540 -0.077599 -0.119755 0.016348 0.018838 -0.017877
polarizability: 3.08487389e+02 2.48939980e+01 2.15331907e+02 -1.81217432e+01 2.56246973e+01 1.70384379e+02
1716.lowfreq: -23.1169 -7.7647 -4.0829 -0.2014 -0.0007 -0.0004 0.0005 24.5769 33.2181
frequency: -18.9784 24.5481 32.9882 39.4576 56.4930 67.5687 73.2579 95.0344 123.6645 138.9020 150.4387 164.2141 182.8064 194.0098 201.3357 208.0924 227.6169 241.3672 251.5079 260.3066 275.2806 285.6065 294.4919 307.1272 331.1305 353.5970 365.0596 391.7712 408.1666 410.4674 431.5519 439.6201 470.1807 500.5872 566.8590 580.2453 613.2868 618.2046 632.3770 645.9838 662.2674 694.2104 712.0484 713.8368 725.2230 758.1271 765.0630 796.9781 819.7762 844.7831 868.5902 909.2981 915.5182 918.8866 927.3214 947.7009 958.4360 973.2703 986.3573 992.5932 1010.4072 1016.3654 1035.2360 1054.5952 1066.4186 1080.3160 1088.9327 1094.9223 1102.6019 1127.0017 1140.4646 1146.4536 1173.0300 1174.2356 1178.3896 1186.7212 1197.3196 1217.6675 1246.0997 1280.9305 1282.2861 1306.0181 1320.4024 1330.7311 1336.0110 1343.4856 1357.1237 1379.0901 1385.2014 1393.7091 1397.6058 1406.4695 1432.6775 1444.9460 1447.4409 1460.7373 1465.4227 1470.0386 1474.6962 1482.0958 1484.5456 1486.0808 1487.1264 1497.2732 1533.4763 1582.3760 1591.1074 1604.9406 1617.9895 1641.8490 1661.0842 2953.7964 2965.6619 2968.2809 2968.7563 2972.0324 2972.9595 2987.2052 3027.3125 3049.5352 3056.8136 3063.6839 3068.5305 3072.2512 3088.2336 3098.7439 3130.1511 3130.7820 3141.1064 3154.5033 3166.9006 3187.0731 3416.1878 3437.0477 3571.2095
redmass: 3.8033 4.2200 3.2375 4.9016 3.8888 4.3376 4.4679 3.5833 4.3838 2.6366 3.0796 4.0673 1.1742 1.1396 5.2093 1.4892 1.1925 2.4207 4.0021 2.0080 3.4111 1.3562 2.9585 4.7298 2.6544 3.3433 4.0130 2.8614 3.0071 4.2780 3.8444 3.2180 2.6880 3.4234 5.1951 5.3079 6.2803 5.8555 3.2626 2.2778 2.6236 2.4204 5.9938 3.5665 4.4240 1.2030 1.7257 4.8719 2.7881 1.2514 2.1000 2.0840 1.2188 1.7133 2.8629 1.6325 1.7227 1.3648 4.9069 1.3825 3.2741 3.0632 1.9484 1.4498 2.5277 1.9138 1.9833 1.8150 1.6980 2.3422 2.5097 1.6008 1.0520 1.8371 2.0138 1.1470 3.0150 1.5174 3.1377 1.4941 2.2786 1.2427 1.4568 1.3637 1.4794 3.6680 3.5764 1.2318 8.7249 1.5019 1.3069 1.2666 1.1844 2.1594 1.0957 1.0758 1.0481 1.0530 1.0884 1.0598 1.7779 1.0560 1.2462 1.0655 2.2753 3.1758 4.8501 5.1713 4.7542 1.8564 5.5835 1.0626 1.0360 1.0522 1.0385 1.0637 1.0449 1.0849 1.1007 1.0964 1.0992 1.0987 1.0996 1.0984 1.0898 1.0991 1.0907 1.0957 1.0892 1.0941 1.0992 1.0966 1.0757 1.0450 1.0969
irintensity: 0.3170 1.9269 2.4228 0.4933 2.6901 4.1849 3.2674 1.5211 3.4830 5.6867 4.5323 1.3157 0.8019 1.6406 0.3583 0.2837 0.4448 15.0410 8.2953 7.9929 19.1179 49.8148 14.3064 1.2533 4.0874 4.7167 9.2611 1.6328 0.5406 4.9536 12.5652 0.4918 18.8890 9.5649 21.0848 1.5919 0.2651 21.7198 80.2103 138.1081 74.0485 15.9760 0.6078 42.7883 24.7175 90.7464 65.1741 2.1783 3.8032 1.2145 24.0110 1.7586 5.5117 5.9842 11.5653 2.1585 1.6253 0.8344 0.2576 0.3866 12.2644 21.3309 2.2454 2.2815 1.9350 6.9975 6.5171 4.5556 15.5269 10.5130 16.8006 19.9759 0.1682 5.6106 11.7856 0.1989 7.2167 9.8396 19.2890 31.9962 108.5197 0.7652 45.4563 2.7626 2.3019 68.8410 262.0981 21.2821 0.6765 21.3881 7.7902 50.0476 8.8527 22.6203 3.5914 16.8020 0.7346 8.8290 51.1459 6.0776 118.0030 23.6037 31.6717 23.5231 448.7691 252.2408 25.7673 129.0975 115.6048 5.8473 26.1168 25.6995 43.0025 5.7455 43.5006 70.2946 56.3053 32.7558 32.3197 18.1164 21.3709 83.6009 32.3290 64.7818 13.9570 14.7682 6.9271 4.0171 11.1061 24.6749 20.5788 1.7518 59.9060 12.2317 5.6218
temp: 298.150 k
press: 1.00000 atm
elementType: 8 8 7 7 7 7 6 6 6 6 6 6 6 6 6 6 6 6 6 6 6 6 6 1 1 1 1 1 1 1 1 1 1 1 1 1 1 1 1 1 1 1 1 1 1 1 1
symmnumber: 1
zpe: 1022307.1 jmol-1
zpe.correction: 0.389376 hartree
zpe.thermalcorrener: 0.412608 hartree
zpe.thermalcorrenthalpy: 0.413552 hartree
zpe.thermalcorrgfe: 0.336559 hartree
zpe.sumelectzpe: -1029.926922 hartree
zpe.sumelectthermal: -1029.903690 hartree
zpe.sumelectthermalent: -1029.902746 hartree
zpe.sumelectthermalfe: -1029.979739 hartree
dipole: -2.7318 1.2093 1.7234
dipole: 3.4489
quadrupole: -116.2547 -134.8898 -140.4717
quadrupole: -12.0007 -2.6432 2.9807
quadrupole: 14.2840 -4.3511 -9.9329 -12.0007 -2.6432 2.9807
hfenergy: -1030.3162981 hartree
pointgroup: C01 [X(C17H24N4O2)]
dipole: -1.0648367 -0.7634417 0.3528149 debye
polarizability: 297.4628664|31.2093357|174.3490601|36.4514736|-20.33835|222.3917482 unknown
InChI: InChI=1S/C17H24N4O2/c1-11(2)10-14(18)16(22)19-15-12(3)20(4)21(17(15)23)13-8-6-5-7-9-13/h5-9,11,14,19H,10,18H2,1-4H3
charge 0 multiplicity 1
47 atoms
O  2.96542 -0.286267 2.5082
O  -0.306584 1.130099 -1.168579
N  -1.615952 -0.770667 1.544423
N  -1.791628 -0.067018 0.307821
N  1.704984 0.611468 0.747002
N  4.922474 1.605144 1.878563
C  4.920268 -0.123244 0.011757
C  4.208196 -0.757049 -1.213541
C  4.141567 0.994806 0.784399
C  0.38955 0.165127 0.984746
C  -0.271722 -0.560654 1.96858
C  2.881743 0.389179 1.433031
C  3.943656 0.271002 -2.341489
C  5.049814 -1.939189 -1.753566
C  -0.555142 0.504037 -0.087522
C  -2.907795 -0.33842 -0.541974
C  0.149609 -1.087108 3.309592
C  -2.724274 -0.625552 2.521291
C  -3.320533 0.653028 -1.467692
C  -3.57908 -1.586744 -0.480004
C  -4.411697 0.388805 -2.3217
C  -4.680415 -1.827668 -1.328622
C  -5.103458 -0.843285 -2.251585
H  5.169982 -0.914764 0.74689
H  5.880973 0.320231 -0.327547
H  3.231286 -1.165082 -0.87953
H  3.849512 1.790102 0.071171
H  3.260744 1.083254 -2.030944
H  3.482188 -0.220064 -3.217719
H  4.89267 0.736043 -2.673172
H  4.547615 -2.427916 -2.609172
H  5.215306 -2.704439 -0.972305
H  6.041736 -1.588671 -2.099947
H  1.754587 1.160822 -0.123794
H  5.872101 1.87526 1.603781
H  4.903396 1.022493 2.724912
H  -0.300159 -0.50202 4.135519
H  1.244458 -1.012502 3.392945
H  -0.157053 -2.14199 3.43477
H  -2.535168 -1.31058 3.361316
H  -3.675086 -0.90872 2.045498
H  -2.803781 0.412268 2.901405
H  -2.776233 1.598652 -1.523294
H  -3.21594 -2.364889 0.199354
H  -4.725008 1.153383 -3.040823
H  -5.196771 -2.792701 -1.278874
H  -5.955055 -1.036597 -2.912471
