program: Gaussian 09
title: 000173835
version: EM64L-G09RevD.01
frameworkgroup: C1[X(C11H12N2O3)]
method: RPBEPBE
basis: SDD
operation: Freq
keyword: #p
keyword: freq=noraman
keyword: PBEPBE/SDD
title: #p freq=noraman PBEPBE/SDD
converged: YES YES NO NO
title: Mulliken charges:
elementType: O O O N N C C C C C C C C C C C H H H H H H H H H H H H
charge: -0.212829 -0.229432 -0.429215 -0.451178 -0.397223 0.088995 -0.385268 0.449187 0.164947 0.155701 -0.702638 -0.387397 -0.329828 -0.386480 -0.369696 0.284868 0.230732 0.222387 0.327597 0.349691 0.242705 0.199500 0.232062 0.246605 0.254313 0.222315 0.253890 0.355688
chargesum: 0.00000
title: Mulliken charges with hydrogens summed into heavy atoms:
elementType: O O O N N C C C C C C C C C C C
charge: -0.212829 -0.229432 -0.073527 -0.123582 -0.047531 0.088995 0.067851 0.449187 0.164947 0.155701 -0.028370 -0.140791 -0.075516 -0.164165 -0.115806 0.284868
polarizability: 1.77035630e+02 5.56298234e+00 1.26119092e+02 3.80739695e+00 1.90430296e+01 1.11251640e+02
1716.lowfreq: -10.6636 -2.5127 -0.0008 -0.0006 -0.0005 5.8293 35.4254 52.0033 69.5885
frequency: 35.0119 51.9702 69.5770 97.3384 139.5426 161.1982 165.5947 185.7284 237.8307 285.4758 318.3542 322.3556 354.7668 362.0701 403.9438 405.6782 412.5773 478.6219 502.2555 524.4892 587.1416 607.4291 617.9323 634.3314 640.5405 682.1621 711.7862 723.1616 742.7312 779.8971 807.2086 809.4359 833.8076 900.0002 934.9071 958.9702 961.3227 975.9534 1003.2789 1015.8933 1078.4307 1093.4745 1103.5400 1143.3064 1147.3547 1184.1147 1200.5392 1209.0651 1252.4452 1283.9808 1305.5567 1311.7420 1316.2585 1334.3111 1357.8237 1388.8867 1396.1895 1421.9934 1463.8368 1478.7388 1484.3706 1502.7070 1594.2432 1625.7662 1679.0803 1721.1378 2981.3316 3000.7628 3055.3270 3077.0238 3091.3771 3116.1905 3150.3798 3154.9755 3175.1577 3582.0417 3586.3754 3607.3891
redmass: 3.7438 7.5145 4.5777 3.1675 4.0301 5.1553 5.4122 1.8365 1.9533 6.4749 4.0687 4.0322 3.4102 1.2386 4.2265 4.6095 3.4037 1.2236 3.0394 3.0834 4.8202 9.1000 3.9727 6.1290 1.3715 4.3865 3.5146 5.6401 4.5086 1.4579 5.0810 1.3513 1.5590 2.7213 1.4255 1.7505 2.0020 2.8751 2.8594 2.1780 3.1999 1.9739 1.6610 1.5393 2.0047 1.1189 3.6934 2.9636 2.4984 1.4071 2.5556 1.6674 1.5474 1.8525 1.7265 5.1024 1.2238 3.2985 1.0750 1.0504 1.0482 2.6291 6.4933 6.4219 8.6423 9.4570 1.0374 1.0626 1.0980 1.0988 1.1005 1.0893 1.0887 1.0936 1.0965 1.0660 1.0802 1.0796
irintensity: 1.1410 0.1242 0.4280 0.2464 0.5293 2.2928 0.6585 1.9345 4.6771 4.8662 4.5426 0.6572 15.5903 128.2605 10.4433 5.9421 4.8466 96.0579 32.6683 24.5116 9.1598 12.6677 14.8240 3.5444 148.9959 5.2401 3.2824 36.0146 21.2251 32.3421 11.5216 24.9272 40.0386 17.0870 1.3490 5.0507 4.8168 23.9840 5.4321 5.3657 14.1138 8.4080 38.9672 202.9716 41.9122 12.6325 29.8100 67.8182 23.3259 41.4076 168.3966 13.6918 26.5848 51.3799 9.7381 32.6285 13.6255 9.0588 10.5289 10.2689 7.8170 90.2312 19.8823 46.7208 485.2844 453.3824 26.7680 21.6798 3.6321 38.0587 38.6203 17.0816 4.5851 7.8218 3.5174 45.9264 72.3740 34.1695
temp: 298.150 k
press: 1.00000 atm
elementType: 8 8 8 7 7 6 6 6 6 6 6 6 6 6 6 6 1 1 1 1 1 1 1 1 1 1 1 1
symmnumber: 1
zpe: 568821.3 jmol-1
zpe.correction: 0.216653 hartree
zpe.thermalcorrener: 0.231303 hartree
zpe.thermalcorrenthalpy: 0.232247 hartree
zpe.thermalcorrgfe: 0.174675 hartree
zpe.sumelectzpe: -760.417943 hartree
zpe.sumelectthermal: -760.403293 hartree
zpe.sumelectthermalent: -760.402348 hartree
zpe.sumelectthermalfe: -760.459921 hartree
dipole: 1.9274 0.3376 -2.7710
dipole: 3.3922
quadrupole: -98.9873 -92.0311 -94.9097
quadrupole: -14.9382 -7.0319 -2.9364
quadrupole: -3.6780 3.2783 0.3997 -14.9382 -7.0319 -2.9364
hfenergy: -760.6345955 hartree
pointgroup: C01 [X(C11H12N2O3)]
dipole: 0.7510894 -0.1252373 1.0960532 debye
polarizability: 177.2177007|-5.1178138|125.9540426|-3.5094113|18.9741457|111.2346186 unknown
InChI: InChI=1S/C11H12N2O3/c1-2-11(9(15)12-10(16)13-11)7-3-5-8(14)6-4-7/h3-6,12-14H,2H2,1H3
charge 0 multiplicity 1
28 atoms
O  -1.294366 -0.971011 -2.351581
O  -3.555412 1.980275 0.548246
O  4.668412 0.729123 -0.122011
N  -1.782498 0.426302 0.897548
N  -2.56757 0.658001 -1.186863
C  -0.973233 -0.525263 0.110273
C  -1.209261 -1.998812 0.574321
C  0.523145 -0.15497 0.069457
C  -1.598083 -0.337779 -1.314458
C  -2.725009 1.126799 0.157909
C  -0.711272 -2.280881 2.00583
C  1.028347 0.977365 0.749266
C  1.426791 -0.954787 -0.6817
C  2.403339 1.297877 0.707251
C  2.797443 -0.64494 -0.735079
C  3.289086 0.480665 -0.032926
H  -0.70195 -2.665396 -0.145968
H  -2.292564 -2.214015 0.498108
H  -1.739009 0.511948 1.910796
H  -3.143699 1.008973 -1.952309
H  0.366035 -2.061023 2.106901
H  -1.259201 -1.683046 2.758882
H  -0.867566 -3.343926 2.261015
H  0.347469 1.628615 1.30642
H  1.052278 -1.809009 -1.254792
H  2.775884 2.180495 1.243395
H  3.49594 -1.252901 -1.317122
H  4.916322 1.542521 0.383787
