program: Gaussian 09
title: 000173972
version: EM64L-G09RevD.01
frameworkgroup: C1[X(C22H27N3O6S)]
method: RPBEPBE
basis: SDD
operation: Freq
keyword: #p
keyword: freq=noraman
keyword: PBEPBE/SDD
title: #p freq=noraman PBEPBE/SDD
converged: YES YES NO NO
title: Mulliken charges:
elementType: S O O O O O O N N N C C C C C C C C C C C C C C C C C C C C C C H H H H H H H H H H H H H H H H H H H H H H H H H H H
charge: 0.221524 -0.167633 -0.246082 -0.278021 -0.236829 -0.257424 -0.221112 -0.156818 -0.368881 -0.654686 -0.495014 -0.178091 0.117540 0.149054 0.339273 -0.804657 0.213009 0.210897 -0.774722 -0.310646 0.422909 0.145717 -0.230389 -0.460187 -0.366394 0.291360 -0.709150 -0.699363 -0.698202 -0.221852 -0.219258 -0.238968 0.325500 0.312693 0.354801 0.278639 0.284512 0.218704 0.252030 0.270901 0.239637 0.319288 0.273570 0.250434 0.250827 0.248682 0.282653 0.197767 0.264895 0.233134 0.218521 0.235518 0.218912 0.203340 0.235885 0.227202 0.229343 0.226562 0.229146
chargesum: 0.00000
title: Mulliken charges with hydrogens summed into heavy atoms:
elementType: S O O O O O O N N N C C C C C C C C C C C C C C C C C C C C C C
charge: 0.221524 -0.167633 -0.246082 -0.278021 -0.236829 -0.257424 -0.221112 -0.156818 -0.014081 -0.061828 -0.169514 0.134602 0.117540 0.149054 0.339273 -0.241506 0.213009 0.210897 -0.033087 -0.071010 0.422909 0.145717 0.270872 -0.211505 -0.083741 0.291360 -0.013354 -0.026412 -0.031776 0.007491 0.007305 -0.009821
polarizability: 3.08680875e+02 -1.89497357e+01 3.20083076e+02 6.98139419e+00 2.88987451e+01 2.54574364e+02
1716.lowfreq: -12.3657 -8.1890 -4.6580 -0.2154 -0.0007 -0.0004 0.0010 6.1952 17.7109
frequency: -11.6119 4.5741 16.9240 20.2113 24.6969 36.8874 46.5738 49.1670 58.7651 65.2325 69.9710 77.4446 87.4325 111.1751 117.6734 124.5909 140.7673 158.0305 177.1537 183.7881 190.7854 199.9731 212.1519 221.9360 237.1104 246.0163 250.0652 266.7968 272.1621 300.2355 306.9255 312.3768 314.3526 339.8935 352.7996 357.2206 364.0616 368.2900 382.8712 396.9551 407.9279 432.1018 437.8186 445.8588 481.4409 489.8797 516.8993 537.3974 540.3599 555.7290 573.6797 586.0866 611.6385 620.3184 631.8558 642.0390 676.1752 697.2081 707.6832 710.9398 720.3546 721.6931 733.0416 741.5053 748.0551 775.3988 792.7745 833.1414 834.3614 842.6404 862.4647 866.4719 877.5098 907.8371 920.2594 933.9089 934.5285 939.8198 955.9253 961.7875 973.9318 984.0861 989.0851 996.4056 1000.4512 1022.4351 1022.8091 1025.0460 1033.3582 1034.2461 1058.4782 1069.2502 1086.4202 1108.5479 1114.8814 1133.4660 1141.5388 1167.8239 1170.3876 1178.6423 1182.3034 1192.9216 1196.9063 1207.5115 1216.3023 1220.6703 1229.9305 1231.4193 1252.7984 1263.2568 1272.0741 1276.0657 1287.8476 1301.1339 1318.7259 1334.9347 1370.7555 1371.6513 1381.7514 1384.3402 1386.1496 1401.1692 1407.5271 1418.5512 1430.2388 1440.6459 1453.6662 1455.3148 1459.5402 1466.5579 1471.5209 1477.5183 1477.6906 1479.7031 1487.4108 1503.0380 1583.4916 1592.4419 1608.7633 1619.3005 1633.1488 1642.1862 1657.0645 1730.1898 2834.1055 2975.2211 2979.6864 2989.0219 2993.3890 2994.6413 3047.2496 3053.8768 3061.2940 3065.7194 3076.3208 3078.5199 3087.2391 3090.1642 3094.8577 3097.1901 3106.8052 3114.4820 3122.5096 3126.7040 3140.2578 3153.9865 3154.4683 3165.2633 3466.5236 3502.1476 3613.6507
redmass: 3.1103 5.2611 5.3471 4.7637 5.8415 4.8758 6.0958 6.7688 8.0578 5.7515 4.9836 5.6344 3.2252 6.0483 2.4997 3.8923 2.7067 3.4214 3.3173 1.1738 6.6766 3.6203 4.1110 4.6510 1.8433 1.3796 1.8990 2.3042 3.3584 3.1028 2.9974 2.8434 2.9459 3.0836 3.8532 3.4333 2.6547 2.6239 3.1812 4.1429 2.6497 4.4322 4.4262 5.3279 4.3193 4.7554 4.0591 3.5429 5.3905 5.5162 4.1686 4.5865 4.4663 5.1122 1.6186 1.2675 5.0531 5.0889 2.1269 4.1453 7.0639 6.4001 3.8518 5.7745 4.2416 2.7589 6.2090 2.8465 4.3440 1.7908 1.2637 5.1413 6.1844 3.5962 5.8300 1.7337 1.4912 1.6442 3.4202 1.2145 3.2643 1.3694 6.0689 2.5466 1.3350 1.5000 2.0898 1.5373 3.1698 1.8794 2.9901 1.6972 4.0378 2.0179 2.8337 1.6352 1.6859 1.9621 1.0916 1.1101 1.1995 3.6936 1.7846 2.7397 1.7655 1.4640 2.9996 2.0117 1.4705 2.8396 1.1414 2.0252 1.6562 1.4493 1.6355 1.4124 1.6843 1.4663 1.6319 1.2295 6.5377 1.1777 1.1997 1.0968 1.1056 2.1550 1.0478 1.0865 1.0665 1.0493 1.0502 1.0499 2.3013 1.0537 1.9558 1.0662 2.0701 5.8719 5.8323 7.7399 8.4790 1.8523 10.4432 12.7746 1.0792 1.0401 1.0344 1.0355 1.0365 1.0607 1.0967 1.0840 1.1000 1.0528 1.1003 1.0896 1.0998 1.1000 1.0992 1.0999 1.0885 1.1005 1.0961 1.0861 1.0914 1.1150 1.0952 1.1007 1.0464 1.0781 1.0975
irintensity: 0.0509 0.2237 0.2941 0.1279 0.7946 0.2942 0.3345 1.7450 2.5432 5.0467 1.9195 0.0698 2.2679 0.9947 1.0386 1.6828 1.0282 0.4312 0.9556 0.3151 0.3992 0.7862 0.4929 4.1748 2.1155 2.8766 8.3893 3.7352 5.1701 7.3654 10.0261 11.0668 7.6826 1.9498 9.5611 12.8664 4.1510 5.3266 38.1765 15.4308 4.5820 3.2179 1.9189 16.8694 2.1527 1.6665 22.5995 28.7279 7.5287 8.2973 6.1031 5.4010 20.5334 12.6320 176.3469 19.7356 7.4827 9.0175 65.3879 16.1994 19.9750 13.1270 10.8996 16.2425 9.6504 21.7537 11.3733 8.7639 8.0711 0.3597 0.2539 148.3419 128.9961 46.0687 275.0277 9.6581 12.5368 8.5830 13.4198 0.5366 22.9550 0.1299 0.2570 214.8901 1.2958 6.3855 11.1898 7.4328 22.9926 76.4618 270.9333 8.4935 76.0647 15.6164 14.3738 23.3515 69.1385 7.3512 0.6574 1.8830 15.0331 65.4116 1.9186 9.8118 10.9034 7.1109 7.4521 72.6818 6.5882 4.7661 2.6232 50.2336 22.5415 41.3166 76.0866 6.9219 73.7652 50.6795 62.5116 10.3983 5.6650 24.5505 17.3210 18.3296 31.1226 15.1941 0.3472 23.9177 9.8711 0.9237 4.7598 4.5082 13.6304 14.0271 413.2263 44.0809 294.5300 8.0484 10.8691 147.4072 52.0569 36.1122 152.8313 504.6435 53.0033 17.3824 29.1450 18.8683 40.5017 25.1285 19.8718 31.5625 2.8472 30.7636 18.9683 13.1420 10.8899 15.1285 49.4097 34.4645 7.9428 12.4734 3.8252 1.0819 19.9947 2.6770 15.9302 20.8857 16.5656 58.9797 15.5753
temp: 298.150 k
press: 1.00000 atm
elementType: 16 8 8 8 8 8 8 7 7 7 6 6 6 6 6 6 6 6 6 6 6 6 6 6 6 6 6 6 6 6 6 6 1 1 1 1 1 1 1 1 1 1 1 1 1 1 1 1 1 1 1 1 1 1 1 1 1 1 1
symmnumber: 1
zpe: 1213870.3 jmol-1
zpe.correction: 0.462339 hartree
zpe.thermalcorrener: 0.494641 hartree
zpe.thermalcorrenthalpy: 0.495586 hartree
zpe.thermalcorrgfe: 0.394318 hartree
zpe.sumelectzpe: -1865.809844 hartree
zpe.sumelectthermal: -1865.777542 hartree
zpe.sumelectthermalent: -1865.776597 hartree
zpe.sumelectthermalfe: -1865.877865 hartree
dipole: -1.4053 3.3480 2.3392
dipole: 4.3193
quadrupole: -192.6245 -170.9491 -200.5258
quadrupole: -1.4619 -7.6668 -10.6543
quadrupole: -4.5914 17.0840 -12.4926 -1.4619 -7.6668 -10.6543
hfenergy: -1866.272183 hartree
pointgroup: C01 [X(C22H27N3O6S1)]
dipole: 0.6262873 1.4088527 -0.7145637 debye
polarizability: 309.5968439|18.9372589|325.3159609|10.3575138|-18.7535945|248.4255102 unknown
InChI: InChI=1S/C22H27N3O6S/c1-12-10-32-19-15(24-17(26)14(23)13-8-6-5-7-9-13)18(27)25(19)16(12)20(28)30-11-31-21(29)22(2,3)4/h5-9,14-15,19,24H,10-11,23H2,1-4H3
charge 0 multiplicity 1
59 atoms
S  1.998531 2.331069 0.716258
O  -1.231766 -0.655206 -0.237275
O  -3.262563 1.344723 0.945207
O  2.415701 -2.178609 2.58089
O  -3.395553 3.158193 -0.533093
O  -4.718636 0.013393 -0.409823
O  -4.387616 -1.685573 1.158459
N  -0.594557 1.37807 0.962804
N  1.871253 -0.82111 0.771281
N  4.739696 -2.990267 1.433967
C  0.699012 1.336286 1.671877
C  0.73461 -0.220966 1.423628
C  -0.548174 0.016744 0.548927
C  -1.257461 2.543322 0.502982
C  -0.572299 3.735391 0.382806
C  0.910076 3.887499 0.69674
C  2.630165 -1.799062 1.391408
C  -2.716841 2.414635 0.212162
C  -1.216319 5.046744 -0.019479
C  3.73003 -2.468054 0.513377
C  4.323137 -1.520657 -0.536494
C  -4.530641 -2.265454 -1.265148
C  -4.663927 0.988521 0.664853
C  3.813392 -1.502411 -1.859459
C  5.374378 -0.636404 -0.187611
C  -4.508421 -1.350548 -0.034933
C  -3.622663 -1.687093 -2.385956
C  -6.007531 -2.340024 -1.764724
C  -4.036467 -3.669482 -0.840623
C  4.334572 -0.601877 -2.818386
C  5.894949 0.261898 -1.143442
C  5.374881 0.285489 -2.460607
H  0.66322 1.687647 2.713617
H  0.53684 -0.789256 2.348968
H  2.144742 -0.504951 -0.16398
H  1.376404 4.541391 -0.062012
H  1.028324 4.390869 1.675375
H  -0.739073 5.888392 0.517345
H  -1.072665 5.224343 -1.103476
H  -2.300841 5.063266 0.159264
H  3.173813 -3.267814 -0.042061
H  4.354393 -3.239296 2.351065
H  5.376594 -3.67945 1.031494
H  -5.031952 0.563374 1.610317
H  -5.21882 1.865219 0.300511
H  3.020072 -2.205679 -2.146505
H  5.776594 -0.689181 0.829564
H  -3.629879 -2.379932 -3.247759
H  -2.586556 -1.570481 -2.027852
H  -3.984429 -0.700918 -2.720817
H  -6.055784 -3.00121 -2.64918
H  -6.379417 -1.341979 -2.053821
H  -6.674428 -2.756723 -0.987652
H  -4.090461 -4.356195 -1.704857
H  -2.99035 -3.627131 -0.490416
H  -4.65077 -4.081465 -0.021599
H  3.936236 -0.600024 -3.839151
H  6.70734 0.943258 -0.86587
H  5.783403 0.981448 -3.201984
