program: Gaussian 09
title: 000173885
version: EM64L-G09RevD.01
frameworkgroup: C1[X(C20H22N4O2)]
method: RPBEPBE
basis: SDD
operation: Freq
keyword: #p
keyword: freq=noraman
keyword: PBEPBE/SDD
title: #p freq=noraman PBEPBE/SDD
converged: YES YES NO NO
title: Mulliken charges:
elementType: O O N N N N C C C C C C C C C C C C C C C C C C C C H H H H H H H H H H H H H H H H H H H H H H
charge: -0.273481 -0.264302 -0.143147 -0.265309 -0.412192 -0.623078 0.347973 0.028917 0.107388 -0.162059 -0.630936 0.450983 0.134781 -0.755607 -0.638052 0.460174 -0.358539 -0.387198 -0.405441 -0.402206 -0.214522 -0.211487 -0.250894 -0.222972 -0.231337 -0.249511 0.243990 0.216822 0.236613 0.347583 0.217945 0.257187 0.281724 0.268681 0.240324 0.248722 0.281807 0.261685 0.263287 0.321967 0.266428 0.230894 0.229055 0.228165 0.230756 0.247593 0.222783 0.228041
chargesum: 0.00000
title: Mulliken charges with hydrogens summed into heavy atoms:
elementType: O O N N N N C C C C C C C C C C C C C C C C C C C C
charge: -0.273481 -0.264302 -0.143147 -0.265309 -0.064608 -0.037824 0.347973 0.028917 0.107388 0.081930 -0.177501 0.450983 0.134781 0.001249 0.119676 0.460174 -0.076732 -0.125513 -0.139013 -0.171312 0.014533 0.016678 -0.020138 0.024621 -0.008554 -0.021470
polarizability: 3.29507068e+02 -2.76902586e+01 2.79043344e+02 2.84737924e+00 -1.49743554e+00 1.60966893e+02
1716.lowfreq: -8.3581 -4.5916 -2.8127 -0.0005 0.0004 0.0005 9.3921 24.8503 36.9352
frequency: 8.4129 24.7556 36.9007 41.1382 49.1803 60.8474 75.3556 83.6952 94.2781 116.4819 123.9670 145.7718 151.9153 158.8655 180.6560 210.0253 240.5384 258.6675 274.6404 279.3025 283.9869 302.1323 322.1476 340.6992 348.7910 371.0715 389.8442 404.6092 408.2908 409.8334 438.6588 496.0986 501.9347 546.4814 572.5959 574.2885 594.8551 614.7186 615.8700 617.2931 631.1701 642.5027 658.9081 677.1350 697.1513 705.9082 715.1478 725.6776 756.5025 764.7309 813.4670 819.0307 842.2775 853.8722 873.9566 908.7327 916.3649 918.3546 943.1609 967.0545 971.0731 975.5448 985.9687 989.6210 991.0592 995.2530 1011.8135 1025.9875 1032.1212 1041.6161 1052.8145 1078.4403 1079.7947 1096.1648 1123.7359 1134.4304 1141.0180 1149.0557 1172.0957 1172.3475 1173.0697 1184.8450 1189.1899 1193.1920 1213.5821 1222.3270 1278.0029 1300.7569 1307.5389 1317.4635 1326.5874 1334.1664 1363.3078 1380.3662 1383.1282 1387.9964 1405.2028 1431.6657 1439.3872 1443.5983 1449.5234 1462.7391 1467.4525 1470.5588 1481.0665 1485.1817 1493.8284 1504.4833 1574.8596 1589.1299 1589.8538 1605.6534 1611.1767 1623.1166 1637.2263 1641.8065 2944.8267 2980.2257 2990.2472 2993.5864 3055.2935 3080.6126 3088.8176 3099.0948 3110.2160 3128.8511 3129.4766 3130.1680 3139.5076 3142.4307 3150.8964 3152.7520 3166.2604 3171.4414 3189.7571 3463.9594 3467.3480 3618.1385
redmass: 4.5549 4.8023 6.0738 5.0300 4.2425 4.5031 5.1311 4.8542 4.2878 1.7062 1.9803 3.3145 3.1335 4.2249 1.1468 5.0337 3.8114 3.6261 3.0958 4.7798 1.6467 3.2186 4.0214 2.4003 2.2652 5.4603 5.0287 2.9176 3.2039 4.9400 5.0490 3.1013 3.3453 1.4568 4.6306 5.0760 4.8228 6.1150 4.4749 5.4319 1.7446 4.3246 3.2639 5.1431 2.2271 1.9139 6.0765 3.0023 1.8434 1.7672 4.9150 4.4349 1.2537 1.2538 3.3340 1.8081 1.6383 1.8791 2.3102 3.7222 1.3670 1.4012 4.4008 4.7394 1.4286 1.4240 3.4639 2.1487 1.9405 1.5422 2.4025 1.8492 1.6344 1.9813 1.9444 1.5315 2.0757 1.2393 1.3201 1.0986 1.5174 1.1635 1.1254 3.1746 2.6362 2.9299 1.3264 3.2947 1.2570 1.6082 1.2474 3.1143 1.6748 4.5354 4.9432 3.1863 1.4896 1.1595 2.1658 1.9183 1.2552 1.1124 1.0761 1.1141 2.2814 2.4296 1.2162 1.8622 1.9074 5.8690 6.5101 6.8583 6.1256 8.1983 2.5243 3.8449 1.0842 1.0414 1.0608 1.0365 1.1025 1.0970 1.0928 1.1003 1.0875 1.0929 1.0934 1.0882 1.0891 1.0900 1.0965 1.0943 1.0995 1.1002 1.0961 1.0703 1.0529 1.0976
irintensity: 0.8136 0.4839 0.6362 2.2247 3.6908 5.5434 2.9710 0.5537 2.6603 3.7636 1.8928 1.2441 9.8892 2.1286 1.4970 3.3835 3.6176 6.7479 6.2414 4.0980 48.2691 7.5268 5.9912 1.9667 14.9865 9.1285 2.1141 1.0627 1.5303 19.5892 7.7053 19.7488 11.2959 281.4813 4.1754 34.2567 10.6389 1.5877 6.2092 10.3021 81.5765 17.6439 55.8219 10.2518 26.7114 41.8806 8.3571 42.1863 43.4308 62.0720 3.5725 1.2408 1.4178 1.9357 10.6357 0.9243 9.2749 12.7631 3.9272 13.6164 1.0343 0.6861 0.3966 0.2567 0.4338 0.3793 15.9426 6.8477 2.1939 2.5086 13.2864 7.3824 13.7190 3.5189 10.2529 66.7429 9.4397 1.9947 15.8164 2.6574 26.6832 0.1440 2.4492 5.4091 23.4208 107.4442 2.4460 107.8457 4.1514 69.8213 0.3229 99.6496 19.7819 26.2531 4.0739 31.1548 53.8682 28.9816 10.2517 15.1180 7.5883 4.8096 60.3822 30.8094 15.2407 146.0875 45.6612 154.0194 259.4235 2.6548 7.1309 164.2529 2.9610 271.1908 12.8490 7.6549 36.5430 57.1708 46.2968 15.6668 17.3295 4.8698 12.0366 20.9329 8.6624 9.4615 3.0764 9.5095 10.6472 6.0713 42.8853 24.4702 23.6288 11.0547 1.5928 37.8776 75.9002 15.4497
temp: 298.150 k
press: 1.00000 atm
elementType: 8 8 7 7 7 7 6 6 6 6 6 6 6 6 6 6 6 6 6 6 6 6 6 6 6 6 1 1 1 1 1 1 1 1 1 1 1 1 1 1 1 1 1 1 1 1 1 1
symmnumber: 1
zpe: 1011906.7 jmol-1
zpe.correction: 0.385415 hartree
zpe.thermalcorrener: 0.410099 hartree
zpe.thermalcorrenthalpy: 0.411043 hartree
zpe.thermalcorrgfe: 0.328417 hartree
zpe.sumelectzpe: -1142.900776 hartree
zpe.sumelectthermal: -1142.876092 hartree
zpe.sumelectthermalent: -1142.875148 hartree
zpe.sumelectthermalfe: -1142.957774 hartree
dipole: -2.4858 -1.6076 0.9208
dipole: 3.1002
quadrupole: -126.7064 -149.2408 -152.2760
quadrupole: 8.2400 -0.3736 -0.3142
quadrupole: 16.0346 -6.4997 -9.5350 8.2400 -0.3736 -0.3142
hfenergy: -1143.2861911 hartree
pointgroup: C01 [X(C20H22N4O2)]
dipole: 1.0195792 -0.5680594 -0.3542573 debye
polarizability: 325.3015035|31.0596982|283.2797284|1.5265518|-0.9148697|160.9360721 unknown
InChI: InChI=1S/C20H22N4O2/c1-14-18(20(26)24(23(14)2)16-11-7-4-8-12-16)22-19(25)17(21)13-15-9-5-3-6-10-15/h3-12,17,22H,13,21H2,1-2H3
charge 0 multiplicity 1
48 atoms
O  0.521568 1.307748 0.324386
O  -1.585533 -3.007517 0.759438
N  2.392743 -1.637775 -0.424685
N  2.305368 -0.277099 0.015427
N  -1.223372 -1.059717 -0.475698
N  -4.20662 -3.084939 0.205008
C  1.070655 -2.093415 -0.615667
C  0.185919 -1.055738 -0.359282
C  0.930173 0.137749 0.047912
C  -3.567667 -1.801324 -0.070454
C  -4.092676 -0.618996 0.853715
C  3.4451 0.580445 -0.040198
C  -2.044791 -2.016057 0.112208
C  0.784029 -3.50067 -1.041097
C  3.38455 -2.483858 0.286663
C  -3.893114 0.768946 0.264312
C  3.494041 1.714113 0.811003
C  4.505143 0.321916 -0.948254
C  -2.781732 1.578505 0.616614
C  -4.810533 1.265514 -0.702111
C  4.607484 2.577836 0.74928
C  5.620654 1.185215 -0.983399
C  5.679199 2.315932 -0.136256
C  -2.582997 2.84142 0.012263
C  -4.624113 2.532746 -1.296989
C  -3.506132 3.325433 -0.941995
H  -3.754408 -1.488642 -1.119736
H  -5.176577 -0.804421 0.983706
H  -3.624705 -0.70988 1.851505
H  -1.660259 -0.193272 -0.811604
H  1.632314 -3.943298 -1.590375
H  -0.100889 -3.509062 -1.69995
H  0.525004 -4.133989 -0.173653
H  4.387961 -2.042226 0.191733
H  3.390422 -3.478909 -0.183543
H  3.13123 -2.58656 1.359625
H  2.660364 1.914926 1.48742
H  4.433034 -0.523945 -1.640015
H  -5.197486 -3.049804 0.446041
H  -3.632413 -3.709051 0.781084
H  -2.049332 1.221421 1.348836
H  -5.68029 0.656249 -0.981186
H  4.639229 3.456403 1.402929
H  6.436404 0.981884 -1.686097
H  6.543927 2.987141 -0.170694
H  -1.698979 3.428038 0.28108
H  -5.346607 2.90182 -2.034098
H  -3.355088 4.305561 -1.40825
