program: Gaussian 09
title: 000173764
version: EM64L-G09RevD.01
frameworkgroup: C1[X(C18H36O2)]
method: RPBEPBE
basis: SDD
operation: Freq
keyword: #pfreq=noraman
keyword: PBEPBE/SDD
title: #p freq=noraman PBEPBE/SDD
converged: YES YES NO NO
title: Mulliken charges:
elementType: O O C C C C C C C C C C C C C C C C C C H H H H H H H H H H H H H H H H H H H H H H H H H H H H H H H H H H H H
charge: -0.413129 -0.239333 -0.386134 -0.388354 -0.388197 -0.388378 -0.384857 -0.399810 -0.387913 -0.055262 -0.384432 -0.386029 -0.381025 -0.373535 -0.495538 -0.719816 -0.352896 -0.357054 0.181929 -0.696783 0.189363 0.196862 0.201358 0.187979 0.191526 0.196488 0.217478 0.182673 0.190981 0.195250 0.228359 0.189288 0.191798 0.195472 0.208195 0.194545 0.191323 0.194357 0.191516 0.190454 0.192546 0.188497 0.190093 0.236657 0.241023 0.220988 0.218329 0.214279 0.186951 0.187868 0.195015 0.194439 0.209490 0.209619 0.214719 0.370772
chargesum: 0.00000
title: Mulliken charges with hydrogens summed into heavy atoms:
elementType: O O C C C C C C C C C C C C C C C C C C
charge: -0.042357 -0.239333 0.000091 0.000982 -0.000183 0.011774 0.001373 0.017837 -0.000643 0.152933 0.001436 -0.000157 0.001975 0.005055 -0.017858 -0.066220 0.021923 0.032400 0.181929 -0.062956
polarizability: 2.70544539e+02 1.19984155e+00 1.73517690e+02 1.89752204e-02 -1.75250192e+00 1.69860896e+02
1716.lowfreq: -16.0968 -6.2314 -2.1332 -0.0022 0.0010 0.0017 8.7444 16.4671 19.6121
frequency: 4.2574 15.5141 19.3942 28.2501 34.3374 43.2317 49.3544 53.0386 69.1426 81.5381 93.5057 102.7845 110.1151 123.4537 127.6292 134.3704 141.2844 152.1712 156.9960 159.0914 175.4259 215.9407 223.4993 235.3970 245.9388 294.4201 325.5282 368.1041 393.4124 416.9055 434.5697 456.2871 466.8953 497.2498 508.1252 525.2540 628.6766 694.1542 718.7358 719.6640 722.0452 727.6392 738.6226 757.3426 784.5604 798.8629 821.2562 847.5439 862.2677 888.4221 897.7638 917.9401 933.5172 954.0284 976.2165 981.3823 990.9664 1002.8147 1014.3999 1024.3812 1031.8496 1033.6501 1036.3329 1054.7199 1067.3087 1076.2464 1079.1525 1079.7469 1081.5322 1085.2082 1116.0276 1120.0253 1127.1161 1153.7529 1179.9728 1195.0002 1198.7287 1213.6079 1222.1627 1223.1097 1237.6525 1243.9964 1253.6510 1262.9629 1268.6117 1276.0303 1277.2602 1281.3557 1285.4053 1286.5999 1288.3442 1294.1696 1295.7988 1297.3941 1303.1693 1306.0933 1318.8301 1333.2415 1345.3946 1351.6285 1353.1439 1355.7878 1357.2864 1357.8895 1362.5448 1390.2375 1391.0379 1453.5808 1457.7765 1458.5147 1459.5093 1460.8389 1461.5998 1463.0450 1464.1873 1467.3935 1471.3584 1472.3092 1475.8742 1477.6912 1479.7135 1480.7292 1484.0900 1486.7773 1489.3255 1656.6740 2946.9298 2947.0794 2948.2277 2949.0005 2949.5861 2950.6069 2951.0940 2953.5558 2956.8219 2960.3022 2960.8697 2963.6650 2965.8893 2967.7896 2971.0689 2975.3320 2980.4845 2982.0840 2984.8905 2988.8672 2993.9840 2999.8708 3006.3081 3013.2844 3020.6613 3026.0262 3028.2074 3035.1095 3040.9851 3044.2453 3067.5408 3069.6337 3069.7295 3075.9206 3092.8039 3501.0823
redmass: 4.3163 3.8560 5.0779 6.2540 1.9806 3.1264 3.0054 1.9305 3.1357 1.7177 2.8404 3.3437 1.6797 3.0476 3.3662 1.8221 2.7483 2.1289 2.0254 3.2633 2.6435 1.3390 2.2500 1.1251 3.3306 3.3723 3.3272 2.9174 3.6036 2.5481 2.3405 2.5711 3.1379 2.9566 2.9897 3.2138 1.4101 2.5366 1.0584 1.0622 1.0756 1.1005 1.1373 1.1799 1.2122 3.9836 1.2691 2.7016 1.2746 1.8963 1.4431 1.4860 1.7771 1.3363 5.2906 2.2745 1.6444 4.2663 1.3332 2.4590 2.2867 2.2831 1.2818 3.1053 2.7510 2.5821 2.2318 2.2297 2.1199 2.4376 2.1129 1.5735 2.5094 2.1185 1.9283 1.6092 1.3406 1.4276 1.3287 1.3582 1.3897 1.3020 1.3488 1.3122 1.3286 1.0191 1.3207 1.0396 1.2786 1.2147 1.0754 1.1166 1.1214 1.1444 1.3230 1.3216 1.3735 1.4308 1.4875 1.7165 1.6146 1.6238 1.6492 1.6156 1.5057 1.2179 1.2174 1.0866 1.0814 1.0772 1.0826 1.0760 1.0708 1.0704 1.0712 1.0850 1.0844 1.0548 1.0873 1.0428 1.0722 1.0712 1.0928 1.0950 1.0935 7.9821 1.0592 1.0586 1.0593 1.0589 1.0596 1.0594 1.0598 1.0600 1.0599 1.0596 1.0817 1.0589 1.0619 1.0582 1.0370 1.0364 1.0957 1.0962 1.0971 1.0982 1.0994 1.0997 1.1015 1.1029 1.1036 1.0620 1.1030 1.1046 1.1044 1.1042 1.1006 1.0994 1.0992 1.0999 1.1029 1.0637
irintensity: 0.0597 0.0500 0.4703 0.9012 0.0096 0.4086 0.0767 0.0023 0.2917 0.0462 0.0227 0.2505 0.0082 0.0966 0.0109 0.0165 0.1031 0.0028 0.0041 0.1127 0.7637 0.1203 0.0937 0.0008 0.1180 0.0294 0.2256 0.3848 0.6482 2.9376 4.6785 3.5032 0.6809 0.9765 0.0800 41.9617 91.8440 61.6658 18.6196 4.6630 6.0371 0.3258 2.3730 0.7496 1.8123 1.1398 1.4486 13.8081 0.0662 4.7180 1.1373 8.3010 10.7832 0.4888 0.6442 0.3081 2.6941 0.9045 1.0059 27.5142 138.5438 22.4572 9.0231 11.0398 0.7793 8.6510 2.2288 0.0531 0.0525 6.2538 16.0631 14.9427 37.4997 65.2508 0.0221 3.2842 17.0804 1.4123 1.1444 2.8270 3.5530 0.4930 3.9690 0.8516 2.7575 0.3539 4.8396 1.3318 1.0943 4.4466 1.7178 0.2871 1.0970 1.8324 0.6500 30.8394 1.3408 1.2123 2.5176 0.2292 0.1627 1.6299 0.2071 0.9030 13.6342 11.2787 16.7943 2.3941 3.2117 1.4772 5.1035 1.0013 2.3171 0.1619 0.1440 0.2943 1.8329 10.9062 0.3610 12.3113 6.5151 9.0389 5.9133 10.1229 36.5619 205.0654 0.4522 0.3524 1.0832 1.0245 2.3990 0.1025 1.6180 0.0145 7.8766 3.3977 21.6882 108.4475 112.0807 227.9667 35.1684 38.1860 2.1713 1.0255 1.4158 1.6168 1.7452 2.3131 1.3376 0.3394 0.9059 16.9346 4.4090 3.7899 53.1194 381.2662 96.6651 57.1063 55.5112 36.5138 18.7655 20.3858
temp: 298.150 k
press: 1.00000 atm
elementType: 8 8 6 6 6 6 6 6 6 6 6 6 6 6 6 6 6 6 6 6 1 1 1 1 1 1 1 1 1 1 1 1 1 1 1 1 1 1 1 1 1 1 1 1 1 1 1 1 1 1 1 1 1 1 1 1
symmnumber: 1
zpe: 1328434.5 jmol-1
zpe.correction: 0.505974 hartree
zpe.thermalcorrener: 0.532616 hartree
zpe.thermalcorrenthalpy: 0.533560 hartree
zpe.thermalcorrgfe: 0.441863 hartree
zpe.sumelectzpe: -856.309786 hartree
zpe.sumelectthermal: -856.283143 hartree
zpe.sumelectthermalent: -856.282199 hartree
zpe.sumelectthermalfe: -856.373896 hartree
dipole: -0.8966 -0.9659 0.6601
dipole: 1.4740
quadrupole: -121.0719 -126.8235 -127.9664
quadrupole: 2.0948 -1.9403 -1.1974
quadrupole: 4.2154 -1.5362 -2.6791 2.0948 -1.9403 -1.1974
hfenergy: -856.8157595 hartree
pointgroup: C01 [X(C18H36O2)]
dipole: 0.3501284 0.4358005 0.1543076 debye
polarizability: 270.5323998|1.6117393|174.1607469|0.04148|0.6136838|169.2299782 unknown
InChI: InChI=1S/C18H36O2/c1-3-4-5-6-7-8-9-10-11-12-13-14-15-17(2)16-18(19)20/h17,19H,3-16H2,1-2H3
charge 0 multiplicity 1
56 atoms
O  8.551594 -1.649898 0.388478
O  6.33215 -2.059718 -0.142735
C  1.432351 0.448217 0.291876
C  2.704357 0.709392 -0.54543
C  0.134736 0.430916 -0.54721
C  3.998039 0.716282 0.300526
C  -1.13683 0.204399 0.301157
C  5.266439 0.965418 -0.545824
C  -2.438729 0.180965 -0.531155
C  6.571771 1.158587 0.270653
C  -3.710622 0.014913 0.330787
C  -5.016758 -0.013172 -0.494602
C  -6.287857 -0.120644 0.377832
C  -7.597348 -0.151808 -0.442383
C  6.917585 -0.058649 1.19558
C  7.760113 1.515939 -0.652241
C  -8.867515 -0.221815 0.435297
C  -10.178521 -0.256707 -0.383288
C  7.180585 -1.333816 0.425912
C  -11.441516 -0.311058 0.503466
H  1.346624 1.225918 1.080109
H  1.537449 -0.521226 0.822436
H  2.791044 -0.06672 -1.333923
H  2.603213 1.681276 -1.073071
H  0.040582 1.391198 -1.096788
H  0.20884 -0.362861 -1.319735
H  4.083996 -0.258426 0.820754
H  3.914672 1.496375 1.087646
H  -1.209574 1.003916 1.068452
H  -1.040874 -0.751289 0.858017
H  5.396128 0.127366 -1.258843
H  5.116571 1.880086 -1.156707
H  -2.515461 1.121265 -1.116779
H  -2.385737 -0.643161 -1.273106
H  6.409437 2.008269 0.967879
H  -3.632509 -0.919825 0.924879
H  -3.762071 0.845548 1.066018
H  -4.984579 -0.865778 -1.204938
H  -5.076836 0.905512 -1.115458
H  -6.318952 0.736727 1.082785
H  -6.226837 -1.034839 1.005008
H  -7.647239 0.751543 -1.086217
H  -7.578571 -1.022498 -1.131042
H  7.806684 0.185036 1.800394
H  6.068253 -0.248388 1.875291
H  7.945428 0.717051 -1.394644
H  8.692863 1.660094 -0.076854
H  7.550895 2.448054 -1.20863
H  -8.888192 0.652004 1.120097
H  -8.818104 -1.122009 1.08347
H  -10.161489 -1.135322 -1.060216
H  -10.22229 0.638068 -1.037613
H  -11.498346 0.574081 1.165075
H  -11.433937 -1.210204 1.148435
H  -12.364769 -0.33882 -0.104333
H  8.674959 -2.485467 -0.140743
