program: Gaussian 09
title: 000173743
version: EM64L-G09RevD.01
frameworkgroup: C1[X(C15H13N3)]
method: RPBEPBE
basis: SDD
operation: Freq
keyword: #pfreq=noraman
keyword: PBEPBE/SDD
title: #p freq=noraman PBEPBE/SDD
converged: YES YES NO NO
title: Mulliken charges:
elementType: N N N C C C C C C C C C C C C C C C H H H H H H H H H H H H H
charge: -0.446557 -0.126923 -0.050902 0.202539 0.316574 0.170755 -0.041447 -0.369736 0.321018 -0.409715 -0.795984 -0.257685 -0.227544 -0.361676 -0.390689 -0.232369 -0.228908 -0.239293 0.218793 0.234498 0.335168 0.212199 0.239163 0.257642 0.232793 0.232097 0.261625 0.265060 0.225965 0.225945 0.227594
chargesum: 0.00000
title: Mulliken charges with hydrogens summed into heavy atoms:
elementType: N N N C C C C C C C C C C C C C C C
charge: -0.111389 -0.126923 -0.050902 0.202539 0.316574 0.170755 -0.041447 -0.150943 0.321018 -0.175217 -0.086979 -0.024893 0.004553 -0.100051 -0.125629 -0.006404 -0.002963 -0.011699
polarizability: 3.13864266e+02 5.89564442e+00 1.81655830e+02 4.69188566e+00 -2.18311522e+00 8.02636706e+01
1716.lowfreq: -8.4866 -5.2491 -0.0008 -0.0005 -0.0002 4.0077 26.4542 39.8238 62.0503
frequency: 26.2568 39.8069 62.0446 88.1531 115.1943 141.5857 158.2762 197.3932 237.8698 265.0111 316.7247 335.6327 395.4205 405.4293 442.4765 451.7969 491.2107 501.5678 532.2652 557.7405 615.2176 660.5617 665.0781 691.1198 696.8342 703.1798 723.4752 734.1271 773.7219 791.7964 796.1858 861.7593 870.3923 931.2574 942.1213 947.9557 965.4157 989.2059 990.0789 990.5353 994.6637 1002.0845 1019.8163 1048.4889 1051.5863 1065.7512 1073.7067 1082.2254 1131.3048 1152.4639 1171.4907 1178.7885 1183.8932 1211.6982 1234.0690 1270.3513 1295.9171 1326.9609 1348.5052 1372.4568 1384.8873 1407.4864 1422.3162 1424.1446 1443.1314 1455.4720 1469.3664 1473.3318 1512.1489 1539.1914 1580.4342 1589.2203 1614.0991 1620.7981 2992.4607 3077.1065 3093.3497 3118.0432 3125.1170 3127.7094 3136.3469 3144.4177 3150.9440 3160.9396 3164.9600 3169.5854 3610.5986
redmass: 3.8709 4.5160 4.9075 5.5390 4.0457 1.0748 4.4765 3.6586 5.8661 4.7014 3.6462 4.9564 6.9629 2.8507 4.1615 3.0924 4.2413 3.8614 4.2120 5.6693 6.4475 5.9217 1.8692 2.6508 3.9217 1.7656 3.6915 1.8832 1.8539 2.3907 4.8665 1.2473 1.3290 9.3764 1.4431 1.3845 7.2467 5.9095 1.3407 1.3962 1.6164 1.3222 2.7620 1.5834 2.3394 3.2059 2.0117 2.3409 2.4436 2.6969 1.0549 1.0728 1.1158 2.8867 4.1783 2.3878 1.8735 1.5903 1.9005 5.2367 9.4238 1.2840 1.7921 2.9015 2.3995 1.0584 1.1935 2.4749 3.9701 4.8818 6.7127 6.3650 6.0675 6.1559 1.0365 1.0961 1.1011 1.0872 1.0849 1.0880 1.0888 1.0934 1.0933 1.0959 1.1008 1.1005 1.0825
irintensity: 0.0543 0.1493 0.2759 3.5063 2.1716 0.6080 1.9428 1.9404 0.2492 0.4357 0.5890 3.9944 1.3964 0.0086 2.5947 5.6192 3.0935 3.7172 0.2788 2.5705 0.0598 4.1231 45.4617 22.2493 14.5304 68.3521 23.9603 82.7569 26.2910 36.1739 1.5858 0.0091 0.3053 4.1164 6.0338 0.7415 17.3262 0.3419 0.0141 0.0290 1.3109 0.7718 16.6319 10.5666 8.7236 0.6206 21.4469 5.6477 21.1242 4.2179 0.0813 1.3440 8.1024 2.7196 7.6711 4.1445 1.4039 7.2052 6.9860 1.6634 3.0047 12.3938 18.4815 124.3154 10.2145 15.6633 34.6216 56.2669 11.9725 13.8593 1.0619 0.9720 2.3161 1.7601 18.4650 9.8920 28.1994 13.2733 0.3408 2.6804 13.1528 27.8022 26.3143 18.3214 31.9089 18.3231 55.9809
temp: 298.150 k
press: 1.00000 atm
elementType: 7 7 7 6 6 6 6 6 6 6 6 6 6 6 6 6 6 6 1 1 1 1 1 1 1 1 1 1 1 1 1
symmnumber: 1
zpe: 641950.3 jmol-1
zpe.correction: 0.244506 hartree
zpe.thermalcorrener: 0.259067 hartree
zpe.thermalcorrenthalpy: 0.260011 hartree
zpe.thermalcorrgfe: 0.201425 hartree
zpe.sumelectzpe: -742.415164 hartree
zpe.sumelectthermal: -742.400604 hartree
zpe.sumelectthermalent: -742.399660 hartree
zpe.sumelectthermalfe: -742.458246 hartree
dipole: -2.5922 -0.5384 0.3298
dipole: 2.6680
quadrupole: -85.7521 -93.1552 -110.7662
quadrupole: 4.7315 -0.1357 -0.0712
quadrupole: 10.8057 3.4026 -14.2083 4.7315 -0.1357 -0.0712
hfenergy: -742.6596704 hartree
pointgroup: C01 [X(C15H13N3)]
dipole: 1.0202941 0.2116781 0.1263897 debye
polarizability: 313.9278329|5.2827904|181.6583776|-4.2573185|-0.6277116|80.1975564 unknown
InChI: InChI=1S/C15H13N3/c1-11-7-5-6-10-13(11)15-16-14(17-18-15)12-8-3-2-4-9-12/h2-10,18H,1H3
charge 0 multiplicity 1
31 atoms
N  0.501384 1.84277 0.290297
N  -0.139876 -0.255461 -0.075218
N  -0.886275 1.910025 0.301034
C  2.376926 0.190411 -0.022487
C  2.848554 -1.132583 0.260569
C  0.951343 0.545723 0.063723
C  -1.234115 0.601711 0.069041
C  3.306705 1.204487 -0.394083
C  -2.631171 0.150625 -0.015616
C  4.24373 -1.372289 0.173102
C  1.924088 -2.270171 0.6484
C  4.687124 0.940489 -0.47217
C  5.160126 -0.359372 -0.183228
C  -3.702405 1.069551 0.148496
C  -2.916147 -1.218014 -0.26363
C  -5.036885 0.622233 0.066164
C  -4.253386 -1.660249 -0.344662
C  -5.318448 -0.743355 -0.180352
H  2.943374 2.203587 -0.664346
H  4.613819 -2.380609 0.392238
H  1.03811 2.684671 0.486931
H  2.507776 -3.15657 0.95073
H  1.249643 -1.987042 1.475679
H  1.260984 -2.545635 -0.189853
H  5.382538 1.73335 -0.766943
H  6.230768 -0.583968 -0.241036
H  -3.475469 2.123554 0.339033
H  -2.080559 -1.913612 -0.389967
H  -5.858406 1.336052 0.193918
H  -4.465957 -2.717924 -0.536667
H  -6.356694 -1.088187 -0.243797
