program: Gaussian 09
title: 000173853
version: EM64L-G09RevD.01
frameworkgroup: C1[X(C21H24F3N3OS)]
method: RPBEPBE
basis: SDD
operation: Freq
keyword: #p
keyword: freq=noraman
keyword: PBEPBE/SDD
title: #p freq=noraman PBEPBE/SDD
converged: YES YES NO NO
title: Mulliken charges:
elementType: S F F F O N N N C C C C C C C C C C C C C C C C C C C C C H H H H H H H H H H H H H H H H H H H H H H H H
charge: 0.242468 -0.164720 -0.170959 -0.169247 -0.432750 -0.104509 -0.062539 -0.292172 -0.346792 -0.354417 -0.330980 -0.380254 -0.380267 -0.438061 -0.410445 -0.613468 0.539793 0.530870 -0.383618 -0.336608 -0.462584 -0.294265 0.326251 -0.254978 -0.429536 -0.388891 -0.412905 0.300648 0.235672 0.193429 0.196649 0.215616 0.191288 0.191680 0.222400 0.206780 0.178185 0.184913 0.206754 0.210548 0.244718 0.212651 0.251981 0.223616 0.184849 0.222523 0.279581 0.243054 0.255727 0.275123 0.267087 0.224260 0.355853
chargesum: 0.00000
title: Mulliken charges with hydrogens summed into heavy atoms:
elementType: S F F F O N N N C C C C C C C C C C C C C C C C C C C C C
charge: 0.242468 -0.164720 -0.170959 -0.169247 -0.076896 -0.104509 -0.062539 -0.292172 0.043286 0.052487 0.083100 0.004710 0.011400 0.017205 0.054187 0.017520 0.539793 0.530870 -0.383618 -0.336608 -0.183003 -0.051211 0.326251 0.000749 -0.154413 -0.121804 -0.188645 0.300648 0.235672
polarizability: 3.42845428e+02 -5.65591165e+01 2.70221077e+02 -4.00711036e+01 -2.03465156e+01 2.15791018e+02
1716.lowfreq: -5.9295 -1.5119 -0.0011 0.0007 0.0011 5.5410 7.8754 11.2385 13.0201
frequency: 6.0349 11.0074 12.8191 29.2695 34.2319 42.8108 66.2672 75.3407 92.2434 98.1029 143.0434 148.9340 176.6636 188.2765 204.9145 206.7846 224.7066 250.7114 253.8876 270.4352 285.0683 304.2534 317.0391 324.0020 330.5633 331.4637 350.1076 361.0368 366.7770 375.4977 381.4275 400.7340 407.5765 425.8232 435.6679 450.9974 463.9353 472.4138 486.3993 494.8869 509.7057 545.2471 560.3519 567.0717 589.0309 596.3438 633.1534 640.0090 668.5615 676.6334 703.5248 723.6236 732.3881 753.9927 763.2754 786.0314 820.8158 824.8187 844.8270 859.6357 866.7952 872.4143 884.3807 903.7761 907.0918 918.0356 946.1260 972.8477 974.3403 996.6692 1011.1790 1015.9432 1026.3061 1034.6470 1046.0058 1049.3155 1057.0578 1070.5174 1081.5003 1093.8548 1100.9395 1122.6765 1138.8996 1141.5187 1144.4176 1146.9708 1149.7002 1158.8589 1188.0711 1192.1724 1206.0168 1228.6921 1233.1418 1258.7745 1260.9461 1276.3748 1279.4508 1280.9656 1291.9538 1302.4767 1304.6356 1322.9692 1333.5838 1345.8458 1349.6158 1361.3415 1368.4972 1370.7821 1378.7360 1388.9561 1393.1916 1419.7268 1425.4569 1429.9661 1452.6074 1453.2450 1457.2787 1460.0557 1465.9567 1472.6585 1474.9121 1476.8127 1481.4293 1485.6477 1491.6034 1574.3902 1589.8505 1595.3924 1624.0954 2836.5578 2843.5944 2860.1054 2869.8615 2874.3079 2887.4299 2959.7652 2997.7750 3016.9732 3023.6525 3027.5204 3028.9738 3032.4442 3037.5996 3053.3385 3075.4650 3079.7924 3123.4438 3151.3375 3165.8969 3170.5109 3176.6191 3179.8109 3588.1673
redmass: 15.4661 5.6538 4.6529 6.9336 3.2552 4.9617 4.3539 7.6017 4.7230 6.2851 5.4456 3.7395 6.1003 5.5764 6.7269 3.0952 1.2095 4.7474 2.5367 2.5711 4.5938 3.3485 3.5534 2.4097 1.2257 3.1112 4.3814 6.8336 2.6862 4.8693 4.6789 3.2711 2.4637 4.1294 3.5923 3.8475 6.8298 5.0378 2.9135 3.3151 9.3314 4.0602 4.4894 5.8634 3.2097 2.7015 8.7656 6.4448 6.2603 6.4413 4.2679 3.9563 3.1558 3.2410 4.6716 1.4652 1.3613 1.8539 1.5423 4.5452 1.5009 2.9275 1.4784 2.8267 1.6202 2.1555 1.3675 2.2628 7.9600 2.7370 2.8531 4.0046 3.8966 3.1893 2.5941 1.7243 2.2035 2.1281 1.7844 2.2763 2.5648 1.7213 1.8491 1.7908 2.4321 1.4399 2.7269 1.3820 1.4439 1.0729 1.5033 1.5694 2.0565 1.9622 1.8535 1.5194 1.6180 1.6134 1.9316 1.9061 1.2986 1.9648 1.3545 1.3907 1.3922 1.4323 1.4245 1.4424 5.4415 1.4263 8.9900 3.2084 3.4160 1.1679 1.0792 1.0791 1.0918 1.0718 1.0837 1.1025 2.1304 1.2711 1.0546 1.5217 1.8859 7.0286 7.8448 6.2406 6.7889 1.0700 1.0651 1.0629 1.0700 1.0694 1.0690 1.0685 1.0632 1.0723 1.0887 1.0895 1.0901 1.0878 1.0895 1.0989 1.1010 1.0929 1.0898 1.0895 1.0933 1.0930 1.0918 1.0954 1.0661
irintensity: 0.0888 0.0258 0.2877 0.1783 0.1936 0.3179 0.3705 2.8019 0.7616 1.4263 2.4292 1.8923 2.2227 1.3318 0.6817 0.3114 0.0404 2.2918 0.2828 1.1602 1.8036 1.6103 8.1613 9.3086 131.8624 16.1021 3.8059 7.5674 1.7117 1.0556 1.4190 4.9218 0.2408 12.3235 7.9016 6.8914 7.7179 1.8350 0.1554 1.7495 5.2121 5.8557 8.5788 2.2226 9.1204 13.0536 1.9212 6.3934 4.2639 4.5917 2.7483 0.0183 18.0936 19.0219 3.0116 52.0997 62.4003 22.3965 0.0151 103.7208 23.1928 32.1124 55.5589 36.4012 10.3330 9.1303 4.6119 47.9399 170.9652 13.3121 55.6396 102.3024 15.8258 36.1971 40.8672 11.1089 29.6503 74.7546 16.5925 3.9598 23.2268 14.8250 146.8897 50.3058 25.9476 63.3963 55.9628 12.6682 5.0332 1.7966 36.2680 42.0786 158.4430 46.0677 9.0404 39.8232 7.0065 5.8926 73.0601 160.2449 3.5730 186.0187 6.1845 2.3940 10.9954 6.2803 0.9137 4.9203 59.1908 2.0012 6.9774 183.6140 11.1169 1.6779 0.1645 0.8975 11.8115 20.5061 16.5983 17.7792 194.5289 47.3736 7.9244 58.9830 58.5706 16.3661 7.5010 33.4344 41.1493 57.6009 57.1596 126.1969 42.2840 48.9732 256.0600 44.5035 30.8121 49.7094 41.3027 5.3661 68.2146 58.1354 17.9537 46.0472 33.1791 7.7325 19.1858 2.5312 6.4789 1.0702 3.1123 0.2430 54.2562
temp: 298.150 k
press: 1.00000 atm
elementType: 16 9 9 9 8 7 7 7 6 6 6 6 6 6 6 6 6 6 6 6 6 6 6 6 6 6 6 6 6 1 1 1 1 1 1 1 1 1 1 1 1 1 1 1 1 1 1 1 1 1 1 1 1
symmnumber: 1
zpe: 1093047.1 jmol-1
zpe.correction: 0.416320 hartree
zpe.thermalcorrener: 0.443457 hartree
zpe.thermalcorrenthalpy: 0.444401 hartree
zpe.thermalcorrgfe: 0.354466 hartree
zpe.sumelectzpe: -1749.525375 hartree
zpe.sumelectthermal: -1749.498238 hartree
zpe.sumelectthermalent: -1749.497293 hartree
zpe.sumelectthermalfe: -1749.587228 hartree
dipole: -5.0180 0.7874 1.8993
dipole: 5.4229
quadrupole: -188.4281 -180.6394 -170.9700
quadrupole: 5.6405 -18.6212 2.5770
quadrupole: -8.4156 -0.6269 9.0425 5.6405 -18.6212 2.5770
hfenergy: -1749.9416944 hartree
pointgroup: C01 [X(C21H24F3N3O1S1)]
dipole: -2.003134 -0.2219648 -0.7001176 debye
polarizability: 351.0370379|52.9561705|260.7602148|33.5011623|-26.2104612|217.0602701 unknown
InChI: InChI=1S/C21H24F3N3OS/c1-25-9-11-26(12-10-25)7-2-8-27-17-5-4-16(28)14-20(17)29-19-6-3-15(13-18(19)27)21(22,23)24/h3-6,13-14,28H,2,7-12H2,1H3
charge 0 multiplicity 1
53 atoms
S  0.664263 -2.157179 2.017368
F  6.441992 0.511038 -0.498306
F  4.944377 1.387188 -1.966814
F  5.249509 2.3541 0.056383
O  -2.875778 -4.998666 -0.497502
N  -2.364412 1.997073 0.439148
N  -5.230975 2.421431 0.390574
N  0.374011 -0.32551 -0.430793
C  -2.942287 3.302677 0.034027
C  -3.257991 1.317573 1.411581
C  -0.959465 2.100437 0.905222
C  -4.340969 3.107136 -0.574111
C  -4.654001 1.118725 0.799563
C  0.041751 2.16724 -0.270919
C  -0.043906 0.901808 -1.155283
C  -6.613428 2.296531 -0.106567
C  1.704722 -0.42783 0.051504
C  -0.458009 -1.493337 -0.480379
C  2.021212 -1.297338 1.137964
C  -0.4098 -2.463158 0.558697
C  2.761939 0.32686 -0.519832
C  -1.336386 -1.742971 -1.565786
C  4.077521 0.214371 -0.018679
C  3.342842 -1.436637 1.603305
C  -1.195875 -3.627184 0.528535
C  4.383945 -0.669172 1.03985
C  -2.16416 -2.885801 -1.592466
C  -2.092954 -3.830686 -0.544086
C  5.152509 1.084463 -0.595801
H  -3.023386 3.995984 0.90873
H  -2.282787 3.777486 -0.715763
H  -2.822377 0.332559 1.661587
H  -3.361866 1.905452 2.357338
H  -0.807045 2.985046 1.5712
H  -0.730365 1.200841 1.506912
H  -4.777234 4.093789 -0.820251
H  -4.241212 2.52574 -1.527978
H  -4.567292 0.415816 -0.069342
H  -5.322601 0.655145 1.549104
H  -0.1741 3.043733 -0.912677
H  1.061617 2.313091 0.130689
H  0.528411 1.033036 -2.097135
H  -1.108724 0.785349 -1.413245
H  -7.249137 1.839473 0.673095
H  -6.698467 1.670722 -1.032112
H  -7.019791 3.298632 -0.334174
H  2.566491 0.992904 -1.363304
H  -1.375158 -1.046496 -2.40754
H  3.553927 -2.130438 2.422919
H  -1.135438 -4.373487 1.325356
H  5.407872 -0.760809 1.411469
H  -2.844789 -3.040702 -2.438939
H  -3.454347 -5.067349 -1.296636
