program: Gaussian 09
title: 000173848
version: EM64L-G09RevD.01
frameworkgroup: C1[X(C21H30O8)]
method: RPBEPBE
basis: SDD
operation: Freq
keyword: #pfreq=noraman
keyword: PBEPBE/SDD
title: #p freq=noraman PBEPBE/SDD
converged: NO YES NO NO
title: Mulliken charges:
elementType: O O O O O O O O C C C C C C C C C C C C C C C C C C C C C H H H H H H H H H H H H H H H H H H H H H H H H H H H H H H
charge: -0.213728 -0.276194 -0.258317 -0.248254 -0.208406 -0.238944 -0.236142 -0.262360 0.355665 -0.102970 -0.169107 -0.611095 -0.184492 -0.115996 -0.131511 -0.147528 -0.119483 -0.459936 -0.824678 -0.247564 -0.754991 0.173176 -0.736123 0.293684 0.303275 0.327901 -0.761563 -0.763235 -0.768294 0.277395 0.314894 0.245903 0.228699 0.280898 0.213876 0.271134 0.285094 0.245927 0.228148 0.218854 0.222771 0.247468 0.226123 0.257793 0.238274 0.213315 0.218122 0.219957 0.248451 0.229931 0.251992 0.249180 0.248724 0.250393 0.248642 0.248214 0.247224 0.268782 0.241035
chargesum: 0.00000
title: Mulliken charges with hydrogens summed into heavy atoms:
elementType: O O O O O O O O C C C C C C C C C C C C C C C C C C C C C
charge: -0.213728 -0.276194 -0.258317 -0.248254 -0.208406 -0.238944 -0.236142 -0.262360 0.355665 0.174425 0.145786 -0.136494 0.096406 0.097880 0.139624 0.137566 0.126443 -0.012933 -0.128315 0.010229 -0.085280 0.173176 -0.037783 0.293684 0.303275 0.327901 -0.011668 -0.015986 -0.011255
polarizability: 2.68341710e+02 9.47527345e+00 2.46249542e+02 -2.03935263e+00 1.29404374e+00 2.09854052e+02
1716.lowfreq: -39.7971 -13.2733 -6.9792 -0.0009 -0.0007 -0.0005 5.8038 23.3262 29.8384
frequency: -39.7733 23.1836 29.5032 34.4978 35.8243 39.4066 43.5207 50.9113 67.4594 74.8173 85.8769 88.6205 99.3683 108.2250 120.9177 146.1243 156.7489 167.5443 175.4734 180.7097 193.7835 200.3728 207.0606 234.3964 237.4017 245.1237 255.4014 261.1726 275.9718 283.4775 294.9335 331.1417 332.3145 363.5112 370.1340 389.2798 404.3718 427.9054 438.1836 452.5846 484.8812 494.7890 517.9153 546.9969 557.9518 565.9502 567.3158 575.6019 594.1718 603.3583 619.6470 642.3855 651.5503 688.2762 708.7498 744.8460 750.5460 760.9504 776.4825 795.2127 842.7315 857.0163 864.2194 888.5399 897.5250 911.8720 923.7361 932.7484 950.8913 963.9037 967.6876 979.4207 987.2283 993.9281 999.2790 1005.1127 1012.8722 1025.4286 1029.4810 1032.9197 1039.8494 1041.7262 1042.5800 1058.7787 1069.5788 1085.2591 1102.9896 1108.2904 1131.4864 1143.3240 1148.3509 1176.3029 1179.3464 1185.7457 1191.8981 1197.0853 1200.3628 1217.3149 1221.8039 1245.2626 1251.4589 1258.8092 1276.3350 1278.5659 1290.6664 1297.3237 1311.2037 1314.1231 1319.0707 1328.4858 1337.7071 1339.6338 1354.8064 1362.8900 1363.9404 1370.8822 1379.9270 1381.6267 1384.8186 1385.4865 1393.8565 1394.7528 1401.1273 1450.8463 1452.2282 1452.5988 1453.2320 1454.5032 1454.9665 1461.5697 1470.5650 1472.8389 1475.2781 1480.5267 1481.3281 1486.6426 1500.4919 1645.8866 1652.3619 1656.0348 1696.2167 2957.5114 2959.5256 2981.4407 2988.5656 2990.0859 2995.1337 3002.2135 3004.5522 3006.4506 3008.4524 3008.7512 3012.2579 3023.4596 3030.3459 3041.1505 3062.1644 3069.6125 3072.1623 3078.6435 3090.0785 3091.0012 3092.6852 3093.3341 3096.2617 3097.2370 3097.7120 3098.4158 3140.5507 3143.2318 3143.8749
redmass: 1.0639 6.4488 5.6043 4.1661 1.2751 3.9642 6.7731 3.8499 3.2462 3.1402 3.4940 5.0261 1.7465 1.8117 5.1798 4.5117 4.2157 2.0739 3.9153 4.7601 1.5638 4.1702 1.2197 1.3322 2.8255 3.7877 2.5772 4.2728 2.8966 4.8966 5.2839 4.3229 3.6127 2.9410 2.9732 3.0002 3.3337 3.7829 3.4690 4.0644 3.4511 2.9815 3.7015 4.3743 3.4661 3.1610 3.2304 3.3290 4.0931 4.0934 4.8679 3.8434 4.3766 4.4790 3.8752 4.7467 4.7218 4.4141 3.3808 2.8366 4.7602 5.5265 2.6311 2.6393 3.8649 3.3588 2.4874 2.6529 2.0354 2.2265 2.6780 2.0621 1.9284 2.0328 2.0520 1.6389 3.6307 1.9841 2.2100 2.8701 1.6749 1.6629 1.6663 2.5841 2.8180 2.5805 1.9452 2.1648 2.2373 2.5394 3.1018 2.9107 1.7116 2.6341 2.7307 3.0417 2.5793 2.1226 1.5348 1.3222 1.5575 1.3722 1.4888 1.3637 1.2945 1.4577 1.3765 1.4304 1.3826 1.4582 1.2850 1.3799 1.2720 1.1997 1.3872 1.4395 1.3837 1.2388 1.2533 1.2461 1.2154 1.2036 1.1939 1.0601 1.0569 1.0593 1.0480 1.0516 1.0544 1.0695 1.0509 1.0515 1.0583 1.0554 1.0522 1.0557 1.0693 9.3892 9.4844 9.4825 12.3154 1.0812 1.0825 1.0376 1.0570 1.0412 1.0365 1.0840 1.0381 1.0371 1.0370 1.0623 1.0823 1.0871 1.0855 1.0982 1.1007 1.0990 1.0848 1.0978 1.0866 1.0991 1.1006 1.0969 1.0972 1.0975 1.0995 1.0943 1.1024 1.1010 1.1010
irintensity: 1.2138 2.3810 0.6456 1.1817 1.6233 2.9396 0.7302 0.6930 0.8903 3.3607 0.9575 0.8846 4.0940 2.8652 1.5256 1.5989 0.8226 0.6203 2.7820 2.3997 0.4627 0.2011 0.3101 3.5098 0.7212 4.4793 4.0440 3.5003 5.2345 6.2774 2.2187 3.7945 10.7688 2.1159 0.8605 2.5417 2.2289 7.0902 9.3649 4.2200 0.8791 1.9247 2.9375 4.7648 11.6332 4.0471 1.2269 9.0253 6.2478 2.7830 3.4942 2.5320 5.9345 0.7464 1.4238 3.7939 8.5779 7.5647 2.2577 4.2342 38.1981 26.4842 1.8418 84.0598 11.9768 43.9720 80.1039 1.4019 19.8414 20.1796 48.8287 39.4513 53.4583 69.6598 43.3457 8.1837 59.9180 39.7706 45.6809 51.3106 20.1876 5.4555 3.6914 30.4911 4.9858 14.5811 28.7494 12.9677 37.7839 67.1301 13.9442 1.0318 5.3133 115.5221 257.4149 229.7266 166.7901 118.1729 34.3419 9.4423 1.3623 2.5733 5.0195 1.7238 0.2669 3.3546 1.1412 12.8809 8.2919 2.5364 16.6902 3.0504 5.1651 7.5694 9.2773 9.0550 0.2468 50.1082 89.9817 42.6147 9.7762 25.6069 23.1050 29.4446 16.8111 19.3441 23.0066 4.0970 28.1530 3.2502 3.3056 12.2752 18.4912 5.8886 5.6746 23.9683 6.5783 49.0496 183.9026 247.1545 350.8858 12.6495 19.5820 25.1432 12.3959 19.9035 21.1912 8.5462 1.2911 1.8417 1.4751 29.8965 5.3641 10.0799 14.1333 30.2737 34.1677 43.8222 1.9786 39.7363 6.3409 20.5680 18.8788 6.8708 6.2460 26.2655 28.2649 6.9503 7.3110 10.5255 9.2769
temp: 298.150 k
press: 1.00000 atm
elementType: 8 8 8 8 8 8 8 8 6 6 6 6 6 6 6 6 6 6 6 6 6 6 6 6 6 6 6 6 6 1 1 1 1 1 1 1 1 1 1 1 1 1 1 1 1 1 1 1 1 1 1 1 1 1 1 1 1 1 1
symmnumber: 1
zpe: 1267330.9 jmol-1
zpe.correction: 0.482701 hartree
zpe.thermalcorrener: 0.512919 hartree
zpe.thermalcorrenthalpy: 0.513864 hartree
zpe.thermalcorrgfe: 0.419892 hartree
zpe.sumelectzpe: -1417.813762 hartree
zpe.sumelectthermal: -1417.783544 hartree
zpe.sumelectthermalent: -1417.782599 hartree
zpe.sumelectthermalfe: -1417.876571 hartree
dipole: -4.9557 0.9138 -0.0844
dipole: 5.0399
quadrupole: -214.3376 -158.6357 -168.0580
quadrupole: 9.5493 -9.6521 -9.0382
quadrupole: -33.9938 21.7080 12.2858 9.5493 -9.6521 -9.0382
hfenergy: -1418.296463 hartree
pointgroup: C01 [X(C21H30O8)]
dipole: -1.9793308 0.1095212 0.0446339 debye
polarizability: 265.4287137|12.2560564|248.5531922|-3.0616521|3.934429|210.4633989 unknown
InChI: InChI=1S/C21H30O8/c1-9-7-15-14(10(2)20(25)29-15)8-21(6)16(9)17(26-11(3)22)18(27-12(4)23)19(21)28-13(5)24/h9-10,14-19H,7-8H2,1-6H3
charge 0 multiplicity 1
59 atoms
O  4.394445 -1.152596 -0.09844
O  -0.906195 2.515013 -1.030084
O  -2.180979 -2.114324 0.084865
O  -2.967679 0.470128 0.631706
O  6.024481 0.424664 0.393754
O  -1.521477 3.459633 1.02021
O  -4.006879 -2.103469 -1.371973
O  -1.358285 -0.10373 2.239068
C  0.391359 0.3658 -1.053509
C  0.005575 -1.082701 -0.544485
C  -0.743992 1.191571 -0.375306
C  1.79498 0.874716 -0.573181
C  -1.518361 -1.121179 -0.788046
C  0.832309 -2.25439 -1.133333
C  2.401726 0.077229 0.602952
C  -2.027209 0.340171 -0.509996
C  2.916857 -1.336888 0.158818
C  2.354561 -1.929925 -1.142835
C  0.302228 0.497012 -2.598979
C  3.679913 0.712069 1.23767
C  0.558995 -3.584234 -0.385417
C  4.846132 0.04404 0.493587
C  3.805875 2.244911 1.271072
C  -1.307571 3.582487 -0.20573
C  -3.462101 -2.525926 -0.329058
C  -2.51154 0.283085 1.94519
C  -1.43444 4.849127 -1.020942
C  -4.028473 -3.531852 0.646128
C  -3.600737 0.657144 2.921518
H  0.123558 -1.090864 0.555483
H  -0.506868 1.362891 0.68738
H  1.686564 1.936019 -0.280891
H  2.502152 0.872437 -1.424708
H  -1.767437 -1.382338 -1.833309
H  0.533445 -2.398086 -2.193631
H  1.636035 -0.037262 1.390994
H  -2.649772 0.693499 -1.346259
H  2.839237 -2.054742 0.997661
H  2.918285 -2.856408 -1.361263
H  2.594276 -1.226121 -1.959807
H  -0.700484 0.257696 -2.996584
H  0.529973 1.533509 -2.900619
H  1.029453 -0.170132 -3.093381
H  3.750433 0.337864 2.282261
H  -0.507846 -3.859074 -0.423201
H  1.147321 -4.406168 -0.833492
H  0.836536 -3.50825 0.682687
H  2.987109 2.697382 1.858345
H  4.767458 2.525501 1.734085
H  3.792356 2.676889 0.255942
H  -2.226668 4.729635 -1.780719
H  -0.493606 5.054945 -1.559323
H  -1.681812 5.692731 -0.361085
H  -4.021638 -3.118015 1.668906
H  -3.401506 -4.441041 0.659141
H  -5.054277 -3.796901 0.353034
H  -4.594086 0.375823 2.53783
H  -3.58915 1.755002 3.053194
H  -3.40936 0.183391 3.895807
