program: Gaussian 09
title: 000016421
version: EM64L-G09RevD.01
frameworkgroup: C1[X(C14H14NO4PS)]
method: RPBEPBE
basis: SDD
operation: Freq
keyword: #p
keyword: freq=noraman
keyword: PBEPBE/SDD
title: #p freq=noraman PBEPBE/SDD
converged: YES YES NO NO
title: Mulliken charges:
elementType: S P O O O O N C C C C C C C C C C C C C C H H H H H H H H H H H H H H
charge: -0.179904 0.625959 -0.483212 -0.479858 -0.216996 -0.218285 0.021085 0.011337 0.402994 -0.257741 -0.324887 -0.202777 -0.211355 -0.205498 -0.292196 -0.345971 -0.216255 0.381131 -0.348357 -0.332356 -0.654740 0.276398 0.281294 0.230716 0.230851 0.241161 0.241722 0.267369 0.262577 0.240205 0.286461 0.288429 0.213925 0.231560 0.235217
chargesum: 0.00000
title: Mulliken charges with hydrogens summed into heavy atoms:
elementType: S P O O O O N C C C C C C C C C C C C C C
charge: -0.179904 0.625959 -0.483212 -0.479858 -0.216996 -0.218285 0.021085 0.011337 0.402994 0.018657 -0.043593 0.258790 0.029806 0.036224 -0.024828 -0.083394 0.023949 0.381131 -0.061897 -0.043928 0.025963
polarizability: 2.67603084e+02 -1.56793449e+00 2.14061058e+02 -1.04643499e+00 1.38912370e+01 1.99064176e+02
1716.lowfreq: -6.5429 -3.3503 -0.0029 -0.0026 -0.0021 2.9527 9.9584 13.8428 21.0172
frequency: 8.5893 13.1258 20.5478 31.8044 53.2576 61.2348 71.0462 81.3341 94.0160 114.3401 134.7750 176.4987 198.3165 206.2085 237.1697 253.2430 261.1575 271.6972 299.9266 330.7594 350.1789 394.1920 413.7149 419.4525 450.3021 488.6953 492.0640 504.3755 542.3027 581.1233 609.6979 623.4353 656.4740 662.4575 693.5963 701.4213 708.2090 731.5977 762.8967 773.0378 811.3565 816.2312 831.7185 853.4463 855.9885 878.9896 935.6407 972.2756 984.6549 985.0026 985.8374 995.4272 1007.8235 1017.9551 1020.0791 1081.8690 1089.9479 1095.4591 1105.8902 1107.3311 1134.0479 1167.7368 1177.9793 1191.2304 1212.9596 1225.7192 1255.1719 1288.6347 1314.2545 1353.9931 1355.0462 1383.5025 1395.9026 1397.6526 1429.1541 1429.6153 1459.0976 1464.8517 1470.4743 1477.8375 1487.5451 1586.6252 1588.5937 1594.0928 1602.2587 2993.5108 2997.8904 3060.3102 3094.0815 3111.7174 3132.2266 3139.8019 3152.5439 3164.2925 3164.5530 3169.1621 3175.0836 3186.0009 3189.9644
redmass: 6.5801 3.9712 5.2190 3.6389 4.3800 2.6210 6.6630 3.9973 8.7368 9.8522 6.7465 8.0715 5.3156 3.5941 1.9873 5.7391 2.7331 5.0338 6.9959 6.2517 8.0137 2.8101 2.9559 7.9603 8.0304 3.9862 3.1403 8.0106 8.4991 10.0760 6.5063 7.6688 9.5587 4.3801 2.2331 5.5436 6.9047 4.8752 1.5882 9.7908 1.0993 1.2965 6.9544 1.6390 1.2482 4.3652 1.3553 1.3511 1.5120 1.3537 4.3896 2.9591 1.3310 2.5741 2.9194 1.6332 2.7303 3.1602 2.1938 1.2681 1.4280 1.4237 1.0557 1.1390 3.4830 6.1153 1.1430 1.2771 1.3086 2.0380 2.3004 8.9996 1.2538 8.4891 2.4050 3.5705 1.0399 2.0294 2.4345 1.0545 1.0787 6.1495 7.6903 5.8922 6.7291 1.0518 1.0410 1.1078 1.0982 1.1024 1.0879 1.0882 1.0918 1.0897 1.0964 1.0888 1.1013 1.0958 1.0974
irintensity: 0.2334 0.1957 0.0955 0.5029 1.1460 1.0940 0.1985 1.6553 1.1835 2.7934 4.0305 2.3766 4.2740 5.1761 2.1142 6.4975 1.0459 7.4045 0.8308 5.6889 24.8965 0.4404 0.0783 27.3502 12.6840 34.2902 9.4824 41.5323 43.3877 85.3579 2.1286 27.4405 169.5862 18.6404 54.1926 42.2332 82.0650 4.5320 28.2942 13.1488 2.1573 6.7553 215.3163 61.5611 0.0614 176.2334 0.5808 4.0229 0.8667 0.1312 2.4215 4.8734 0.0118 141.0477 7.6005 5.6844 40.4847 18.4393 18.2109 21.1515 6.0139 293.4708 0.2011 21.3330 464.2180 228.0501 1.1371 1.2917 4.8864 63.8249 26.5982 0.9722 26.9722 41.4112 37.9869 4.0178 12.9414 8.2499 111.6295 6.2351 10.7142 9.5564 38.3063 0.5501 217.7958 20.2239 26.7438 11.0539 24.4483 31.2912 0.4849 0.8891 7.5340 3.9260 12.4287 0.9723 19.8246 0.7520 4.7664
temp: 298.150 k
press: 1.00000 atm
elementType: 16 15 8 8 8 8 7 6 6 6 6 6 6 6 6 6 6 6 6 6 6 1 1 1 1 1 1 1 1 1 1 1 1 1 1
symmnumber: 1
zpe: 670425.0 jmol-1
zpe.correction: 0.255351 hartree
zpe.thermalcorrener: 0.276421 hartree
zpe.thermalcorrenthalpy: 0.277365 hartree
zpe.thermalcorrgfe: 0.199851 hartree
zpe.sumelectzpe: -1635.224331 hartree
zpe.sumelectthermal: -1635.203262 hartree
zpe.sumelectthermalent: -1635.202318 hartree
zpe.sumelectthermalfe: -1635.279832 hartree
dipole: 7.3846 0.8120 -2.5443
dipole: 7.8528
quadrupole: -177.0614 -115.5509 -135.0614
quadrupole: 5.7440 -2.5922 4.0867
quadrupole: -34.5035 27.0070 7.4965 5.7440 -2.5922 4.0867
hfenergy: -1635.4796828 hartree
pointgroup: C01 [X(C14H14N1O4P1S1)]
dipole: 2.7641436 0.723575 -1.1751887 debye
polarizability: 266.3213594|6.9324628|215.1680256|-7.0979108|12.9567789|199.2389327 unknown
InChI: InChI=1S/C14H14NO4PS/c1-2-18-20(21,14-6-4-3-5-7-14)19-13-10-8-12(9-11-13)15(16)17/h3-11H,2H2,1H3
charge 0 multiplicity 1
35 atoms
S  2.037098 -0.715869 2.559394
P  2.067357 -0.29269 0.54127
O  0.708828 -0.990343 -0.417039
O  3.302097 -1.00183 -0.427022
O  -5.324033 0.1361 1.3953
O  -5.635799 -1.3750 -0.286983
N  -4.876909 -0.65157 0.471418
C  2.137567 1.46754 0.004593
C  -0.65042 -0.867998 -0.116954
C  2.149101 1.772135 -1.378269
C  2.178667 2.486441 0.982726
C  3.626017 -2.449588 -0.225303
C  2.198186 3.12427 -1.779475
C  2.226463 3.835905 0.568633
C  -1.175152 -0.02062 0.89451
C  -1.51636 -1.649962 -0.926324
C  2.235193 4.154186 -0.809241
C  -3.417798 -0.728916 0.269169
C  -2.566346 0.047933 1.085611
C  -2.904697 -1.58069 -0.73771
C  4.902757 -2.713231 -1.016583
H  2.120016 0.969026 -2.121077
H  2.17895 2.222156 2.04676
H  3.760996 -2.634404 0.857713
H  2.773799 -3.048495 -0.595299
H  2.20681 3.373749 -2.845601
H  2.258431 4.633232 1.318235
H  -0.509867 0.565213 1.534455
H  -1.078192 -2.295931 -1.692065
H  2.270813 5.201812 -1.127411
H  -3.002681 0.689552 1.855408
H  -3.595375 -2.168961 -1.34706
H  5.188308 -3.776531 -0.91549
H  4.754068 -2.492787 -2.087147
H  5.731606 -2.090234 -0.640841
