program: Gaussian 09
title: 000173733
version: EM64L-G09RevD.01
frameworkgroup: C1[X(C18H18N4O2S)]
method: RPBEPBE
basis: SDD
operation: Freq
keyword: #p
keyword: freq=noraman
keyword: PBEPBE/SDD
title: #p freq=noraman PBEPBE/SDD
converged: NO YES NO NO
title: Mulliken charges:
elementType: S O O N N N N C C C C C C C C C C C C C C C C C C H H H H H H H H H H H H H H H H H H
charge: 0.870618 -0.547344 -0.542515 -0.098559 -0.112439 -0.646755 -0.594793 -0.425926 -0.414847 -0.502046 -0.486276 0.170529 0.061741 -0.059946 0.117069 -0.439283 -0.280479 0.383611 -0.064164 0.382600 -0.399336 -0.406785 -0.400520 -0.235314 -0.232292 0.301986 0.263511 0.241449 0.220295 0.282118 0.255969 0.235741 0.291592 0.285328 0.248992 0.335941 0.328996 0.246873 0.244365 0.324225 0.326815 0.235086 0.234169
chargesum: 0.00000
title: Mulliken charges with hydrogens summed into heavy atoms:
elementType: S O O N N N N C C C C C C C C C C C C C C C C C C
charge: 0.870618 -0.547344 -0.542515 -0.098559 -0.112439 0.018181 0.056247 -0.123940 0.090113 0.000366 0.005434 0.170529 0.061741 -0.059946 0.117069 -0.147691 0.004849 0.383611 -0.064164 0.382600 -0.150344 -0.159912 -0.156154 -0.000228 0.001877
polarizability: 3.52662568e+02 -3.60395270e+01 2.52320618e+02 1.31114422e+00 -3.40094357e+01 1.96749658e+02
1716.lowfreq: -5.7635 0.0013 0.0019 0.0020 5.2582 8.2948 18.5689 21.2807 32.0068
frequency: 13.8801 21.1560 31.7671 52.6242 89.0404 103.1706 116.9676 123.4535 161.2485 182.8809 186.3681 205.7468 211.0976 214.3209 229.8296 265.1761 273.3734 297.2258 312.4954 318.7150 371.0925 396.9453 398.4006 410.0040 420.4864 432.9221 439.2748 480.8309 485.0142 491.3267 508.4908 509.0369 520.3932 527.6162 535.3611 560.1172 577.0489 581.9355 625.2639 627.0162 640.9405 659.4313 703.3261 753.4117 761.1556 765.7676 775.8503 784.0090 790.8750 819.9368 834.5721 860.5298 877.3052 883.8498 910.1601 917.9710 923.6240 927.4442 933.7500 966.9331 983.4309 993.4796 999.4593 1012.3358 1023.2808 1052.5090 1057.7225 1087.4756 1119.3798 1129.5809 1130.0169 1142.6409 1152.4614 1156.7326 1175.8699 1194.2809 1209.9053 1221.8145 1242.2354 1263.2055 1270.8961 1296.6399 1297.9605 1313.2307 1335.1714 1342.3398 1344.5467 1391.2593 1409.1057 1425.0043 1433.2882 1438.9516 1446.3571 1456.6909 1471.3841 1476.8498 1486.2853 1512.3492 1539.2825 1567.1593 1581.4881 1594.2074 1603.3798 1623.4669 1632.8732 2941.2672 2984.3949 2988.5173 3011.6188 3040.7586 3060.4223 3083.3764 3126.3073 3131.7490 3133.8776 3137.4074 3147.8568 3160.2907 3166.0085 3552.6539 3564.6592 3706.5243 3724.9175
redmass: 5.3130 5.7057 4.5399 5.0115 5.9109 4.7666 4.4044 4.8167 4.8740 5.4655 4.5563 9.8644 4.7898 8.5000 2.7690 5.2143 5.7597 3.5806 2.8940 4.4961 7.3370 2.5357 1.3288 4.0019 5.0793 3.0022 1.2245 2.8236 3.7430 4.6000 6.7644 3.7422 1.1702 4.8352 1.1118 3.3719 5.3920 4.9567 5.1191 5.8426 3.4754 3.8088 7.9580 4.7212 1.2718 4.4547 7.9794 2.7383 7.6320 6.0222 1.3531 2.1306 2.8227 1.5202 4.8921 2.8938 2.9292 2.2032 1.7012 1.3668 1.4034 2.1956 1.3520 2.6575 2.3630 2.0340 2.2889 2.4093 1.6843 1.6599 1.7264 1.7518 1.2257 1.2860 1.0785 3.2112 1.3540 1.9482 1.4403 1.3413 1.8220 1.8869 1.9706 1.6640 1.5882 1.8079 1.5761 4.3984 4.9695 6.1319 2.2488 2.0260 2.4507 1.6557 1.1860 2.0089 1.2805 3.8149 5.0034 4.2173 6.6782 6.6192 1.5411 1.4503 6.7243 1.0582 1.0666 1.0996 1.0624 1.0865 1.0940 1.1025 1.0859 1.0893 1.0887 1.0913 1.0953 1.0966 1.1005 1.0451 1.0439 1.1041 1.1059
irintensity: 0.3345 0.2058 0.3279 1.1718 3.7573 0.8848 1.4643 0.3835 11.2009 1.4804 6.5233 9.8763 9.1294 2.5553 1.2249 4.1185 1.8149 0.2706 9.2605 2.6809 19.2231 8.5610 150.9163 8.7134 59.7623 16.8921 290.2498 21.8616 34.6966 3.2511 0.2489 6.1386 28.5871 17.5648 61.3247 24.5447 10.2639 30.1045 5.8342 6.2272 15.9093 2.2407 0.1208 1.9082 38.4692 0.5417 53.2074 7.7549 42.1152 10.0949 41.4817 13.2809 9.9631 21.5149 49.6941 5.7520 2.4645 21.5517 6.1805 3.1449 5.8712 1.4673 0.0281 18.6794 7.4238 1.3054 31.4970 0.2277 7.4812 14.1005 4.4167 3.7062 3.5895 5.1341 1.2037 0.7342 33.4678 8.3294 1.4537 2.5914 8.3789 10.6161 6.2851 9.2635 16.7833 8.5730 13.7934 2.6433 4.9335 0.7210 0.9328 99.0248 0.5059 181.4627 6.2535 50.5678 14.9658 15.2780 250.6240 176.3705 6.6809 3.5642 654.3502 249.5964 0.5881 6.9047 18.6449 16.2477 5.6321 14.6823 13.5575 12.8128 1.6588 0.3016 6.0237 3.6075 24.5070 7.0046 33.7732 65.4277 122.5863 36.3597 43.3306
temp: 298.150 k
press: 1.00000 atm
elementType: 16 8 8 7 7 7 7 6 6 6 6 6 6 6 6 6 6 6 6 6 6 6 6 6 6 1 1 1 1 1 1 1 1 1 1 1 1 1 1 1 1 1 1
symmnumber: 1
zpe: 873875.4 jmol-1
zpe.correction: 0.332842 hartree
zpe.thermalcorrener: 0.354999 hartree
zpe.thermalcorrenthalpy: 0.355943 hartree
zpe.thermalcorrgfe: 0.280395 hartree
zpe.sumelectzpe: -1462.346292 hartree
zpe.sumelectthermal: -1462.324134 hartree
zpe.sumelectthermalent: -1462.323190 hartree
zpe.sumelectthermalfe: -1462.398738 hartree
dipole: 1.5023 -5.5510 -3.0308
dipole: 6.5005
quadrupole: -127.3931 -157.1172 -153.7857
quadrupole: -6.9187 -7.9734 -17.4461
quadrupole: 18.7055 -11.0185 -7.6870 -6.9187 -7.9734 -17.4461
hfenergy: -1462.6791332 hartree
pointgroup: C01 [X(C18H18N4O2S1)]
dipole: 0.657837 -2.2181267 -1.0899555 debye
polarizability: 355.3341592|-32.4826316|246.1361477|2.0288477|-36.0034633|200.2625368 unknown
InChI: InChI=1S/C18H18N4O2S/c19-17-15-10-14(7-8-16(15)21-18(20)22-17)25(23,24)13-6-5-11-3-1-2-4-12(11)9-13/h1-6,9,14H,7-8,10,19-20H2
charge 0 multiplicity 1
43 atoms
S  0.537163 1.982153 0.942671
O  0.477748 1.527304 2.520743
O  0.600667 3.562897 0.509378
N  -4.927236 -0.10103 -0.966482
N  -4.718198 -2.095436 0.437789
N  -2.855019 -2.447201 1.791777
N  -6.588828 -1.751609 -0.926305
C  -1.027611 1.17365 0.005803
C  -2.077958 2.258637 -0.217296
C  -1.529001 0.00268 0.851463
C  -3.208431 1.642524 -1.077925
C  -2.912375 -0.433067 0.38265
C  -3.697152 0.313354 -0.526231
C  2.051425 1.13404 0.183034
C  -3.498731 -1.651257 0.864088
C  2.60493 0.057278 0.859607
C  2.582136 1.677197 -1.018986
C  3.767249 -0.576958 0.307032
C  -5.368444 -1.302689 -0.471644
C  4.323861 -0.066869 -0.932794
C  3.71221 1.067228 -1.567087
C  4.39458 -1.695367 0.94884
C  5.485422 -0.703196 -1.482326
C  5.525056 -2.293124 0.387331
C  6.073269 -1.794019 -0.837781
H  -0.565469 0.84753 -0.943735
H  -1.634528 3.139638 -0.712459
H  -2.485479 2.593962 0.754818
H  -0.815328 -0.844435 0.775681
H  -1.538757 0.31387 1.918372
H  -4.068745 2.33218 -1.136508
H  -2.862926 1.49036 -2.120366
H  2.175921 -0.274373 1.812825
H  2.127282 2.567504 -1.465156
H  4.152222 1.460016 -2.490897
H  -1.990046 -2.159761 2.238998
H  -3.333404 -3.289072 2.105519
H  3.97576 -2.072625 1.888966
H  5.909276 -0.319228 -2.417652
H  -6.959589 -2.629548 -0.575155
H  -7.101964 -1.182401 -1.593106
H  5.999575 -3.146593 0.883372
H  6.960667 -2.272745 -1.265764
