program: Gaussian 09
title: 000173801
version: EM64L-G09RevD.01
frameworkgroup: C1[X(C22H18O9)]
method: RPBEPBE
basis: SDD
operation: Freq
keyword: #pfreq=noraman
keyword: PBEPBE/SDD
title: #p freq=noraman PBEPBE/SDD
converged: YES YES NO NO
title: Mulliken charges:
elementType: O O O O O O O O O C C C C C C C C C C C C C C C C C C C C C C H H H H H H H H H H H H H H H H H H
charge: -0.296946 -0.279920 -0.232727 -0.231697 -0.256766 -0.167123 -0.149382 -0.430065 -0.241972 0.278549 -0.317809 -0.353405 -0.734349 -0.707369 0.196412 0.259928 0.201038 0.163653 -0.407481 0.154940 -0.345948 0.261614 -0.348901 0.137717 0.133339 -0.354396 -0.353593 -0.348767 -0.301024 0.247529 0.114624 0.240061 0.261719 0.242799 0.224931 0.225277 0.224200 0.228976 0.245150 0.215104 0.209585 0.301626 0.287116 0.279650 0.278280 0.282596 0.278380 0.293015 0.391829
chargesum: 0.00000
title: Mulliken charges with hydrogens summed into heavy atoms:
elementType: O O O O O O O O O C C C C C C C C C C C C C C C C C C C C C C
charge: -0.296946 -0.279920 -0.232727 -0.231697 -0.256766 -0.167123 -0.149382 -0.038236 -0.241972 0.278549 0.183970 0.114325 -0.055896 -0.037529 0.196412 0.259928 0.201038 0.163653 -0.105855 0.154940 -0.058831 0.261614 -0.069250 0.137717 0.133339 -0.076116 -0.070997 -0.070387 -0.008009 0.247529 0.114624
polarizability: 3.81119193e+02 -2.06981986e+00 1.84692774e+02 -1.31073305e+00 -3.42457591e+01 2.31414654e+02
1716.lowfreq: -8.7748 -4.4964 -2.3158 -0.0009 -0.0007 -0.0005 7.3895 13.7721 29.2753
frequency: 6.6669 13.5151 29.2694 33.4507 34.0002 51.1362 55.2372 74.0060 83.1545 85.8278 93.3728 112.8542 134.5827 144.7275 161.5615 178.6495 183.4869 197.7318 208.7190 217.8532 221.8961 242.4001 253.0444 262.8220 270.2212 281.7371 289.8770 319.6114 351.3003 369.9665 394.6815 407.1403 417.3207 422.8898 431.6961 454.5290 457.7031 469.8000 492.8775 513.1866 524.0341 562.4430 580.8901 593.1722 604.3490 621.4274 628.7338 638.5131 650.7450 668.7277 681.9075 701.8260 724.5461 724.7505 737.5717 741.4710 769.1165 773.7579 778.7044 784.2161 805.6305 877.2684 883.1637 887.3411 888.4337 894.1109 903.0637 925.9979 936.4142 949.4503 952.6846 953.9951 1004.3914 1009.0226 1013.4568 1014.4465 1015.1835 1024.4339 1029.6695 1032.4587 1053.5885 1061.6720 1085.8264 1116.9086 1147.9259 1165.5160 1170.8424 1186.0011 1192.5328 1196.8515 1220.0616 1243.7203 1257.3524 1272.5800 1292.0960 1301.8719 1316.1716 1325.4984 1351.8380 1369.1376 1381.7916 1387.1135 1399.0850 1404.3759 1408.9976 1434.6841 1443.8615 1454.1825 1468.6777 1469.0171 1470.9809 1482.2793 1491.1213 1494.2206 1569.7606 1598.2571 1614.6503 1621.2301 1622.4488 1624.6211 1640.3151 1695.5435 1750.0233 2978.6140 2985.7377 3003.2711 3015.8605 3072.2162 3074.6535 3076.2630 3084.2421 3093.4843 3104.6512 3154.1212 3159.9654 3171.2675 3172.3569 3177.6217 3190.3654 3192.6274 3534.7214
redmass: 7.6827 7.6750 7.6449 6.5858 7.8106 5.0868 9.0945 6.4164 7.4746 6.3500 8.5549 4.7785 6.1606 4.9971 12.6627 5.6019 2.1883 4.2944 1.7406 4.3544 3.2965 1.1881 5.4282 6.7722 4.0313 5.5045 6.7567 5.0027 3.6474 4.3570 3.0728 2.8746 3.0864 3.2545 2.5269 3.4357 6.6684 6.7287 6.3152 6.3791 8.1942 4.6341 8.4872 1.3056 9.3892 4.6515 7.0969 6.1535 9.3317 4.4986 5.8590 3.4549 5.7448 6.1143 5.9009 6.2302 5.5490 12.2853 5.2204 5.8214 4.8326 1.2881 3.6910 1.5198 3.4117 1.6801 3.2065 1.7587 2.3336 1.7493 2.3044 1.5122 4.0686 1.3887 1.3804 1.3860 1.5423 2.9365 1.7496 4.9779 3.7035 3.5814 3.5184 1.3916 1.7391 1.6401 2.9639 1.2565 1.4729 2.0960 1.5294 3.7353 2.5150 2.1597 1.9374 1.3276 1.6069 2.6782 1.3435 1.3471 1.1939 6.2819 5.8230 1.2367 3.8850 5.4853 1.0893 1.0829 1.0555 1.0693 2.8227 1.0571 1.0676 2.5700 8.0948 9.4161 8.4763 7.5027 7.4344 10.1474 8.9274 13.0741 12.9804 1.0355 1.0368 1.0571 1.0575 1.1019 1.1017 1.1033 1.1004 1.1072 1.0983 1.0885 1.0894 1.0898 1.0964 1.0974 1.0970 1.0937 1.0643
irintensity: 0.2606 0.4561 0.1494 0.3646 0.9761 0.9089 0.5823 0.3966 2.7320 2.6307 0.8772 1.4425 2.5009 0.5722 4.0388 3.9885 1.1803 1.5435 1.5404 1.2179 1.5892 0.7588 1.8367 1.8183 10.6886 3.8724 6.5855 2.7204 13.7406 5.5746 4.5136 0.3981 0.8508 2.0023 11.6041 10.6320 25.3716 0.2109 3.5168 6.8541 5.9783 3.0885 10.5530 108.8620 3.7421 25.5161 0.6533 0.2662 8.0330 3.2318 70.0539 120.9226 10.0431 6.8401 6.8902 6.4273 1.3147 172.1756 5.7294 6.3025 11.3853 5.5924 4.4383 18.4396 8.9223 42.7087 6.6646 12.7462 51.7379 5.0869 34.3287 16.9962 135.1599 2.3667 0.1555 0.6692 11.5276 60.4947 7.5974 144.9943 103.6874 233.2071 141.2634 2.9493 80.8040 57.0344 27.5373 10.6437 15.9832 278.6852 6.5341 322.8453 84.2636 105.5417 3.5386 6.0958 5.5711 87.4862 4.5445 20.2977 23.9334 0.3956 5.6835 13.7670 28.7577 4.5465 13.7453 8.7482 0.3611 23.3077 0.2972 10.4925 30.0879 3.2445 41.0333 38.7798 85.9891 3.3479 10.3308 195.7330 211.3790 465.7492 172.4420 25.1609 23.7973 15.8033 46.5673 6.3693 24.1783 9.9800 47.9634 17.8960 30.2143 0.2131 0.5423 0.7118 0.4171 0.5130 0.3757 0.8596 59.2173
temp: 298.150 k
press: 1.00000 atm
elementType: 8 8 8 8 8 8 8 8 8 6 6 6 6 6 6 6 6 6 6 6 6 6 6 6 6 6 6 6 6 6 6 1 1 1 1 1 1 1 1 1 1 1 1 1 1 1 1 1 1
symmnumber: 1
zpe: 941540.6 jmol-1
zpe.correction: 0.358614 hartree
zpe.thermalcorrener: 0.387120 hartree
zpe.thermalcorrenthalpy: 0.388065 hartree
zpe.thermalcorrgfe: 0.295712 hartree
zpe.sumelectzpe: -1523.990888 hartree
zpe.sumelectthermal: -1523.962382 hartree
zpe.sumelectthermalent: -1523.961438 hartree
zpe.sumelectthermalfe: -1524.053790 hartree
dipole: 6.3235 0.1363 1.2486
dipole: 6.4471
quadrupole: -180.0454 -178.3628 -186.9934
quadrupole: 4.0483 12.1755 -6.4271
quadrupole: 1.7551 3.4377 -5.1928 4.0483 12.1755 -6.4271
hfenergy: -1524.3495022 hartree
pointgroup: C01 [X(C22H18O9)]
dipole: 2.4912815 -0.1839773 -0.4397065 debye
polarizability: 381.1060063|2.107439|170.6502461|1.8240071|-17.8748072|245.4703687 unknown
InChI: InChI=1S/C22H18O9/c1-22(2,10-29-18(25)13-5-3-12(4-6-13)17(23)24)11-30-19(26)14-7-8-15-16(9-14)21(28)31-20(15)27/h3-9,23H,10-11H2,1-2H3
charge 0 multiplicity 1
49 atoms
O  2.583738 -1.021426 0.342287
O  2.791719 1.609478 -0.997532
O  2.542689 -2.048794 2.436438
O  -3.687047 -1.885718 -1.074627
O  2.7216 2.119963 1.281573
O  -2.095623 -0.986941 -2.559784
O  -4.671216 -2.848955 0.837974
O  -4.081886 2.425385 -1.698974
O  -4.35877 2.986023 0.539207
C  4.609804 -0.148418 -0.790845
C  4.050622 -0.788292 0.499402
C  4.25477 1.358001 -0.893492
C  6.160461 -0.219924 -0.677997
C  4.131232 -0.913209 -2.048637
C  1.952813 -1.669616 1.39636
C  0.490053 -1.865128 1.127315
C  2.134122 1.980002 0.179433
C  -1.467081 -1.729987 -0.272933
C  -0.093579 -1.499209 -0.11473
C  -2.248368 -2.30098 0.758002
C  -0.296534 -2.443575 2.162413
C  0.670396 2.181909 -0.034839
C  -1.681578 -2.667069 1.990931
C  -2.342477 -1.461915 -1.447131
C  -3.656975 -2.414351 0.285408
C  -0.11543 2.564245 1.084795
C  0.056423 1.9772 -1.297844
C  -1.503941 2.729893 0.944746
C  -1.335512 2.136973 -1.438254
C  -2.119777 2.510068 -0.315857
C  -3.599459 2.672648 -0.409064
H  4.526426 -1.767921 0.691454
H  4.198421 -0.138004 1.380278
H  4.645419 1.912548 -0.020836
H  4.664804 1.776367 -1.828263
H  6.526494 0.236989 0.260772
H  6.638336 0.308534 -1.522888
H  6.501008 -1.270485 -0.704572
H  3.045155 -0.795344 -2.193867
H  4.353528 -1.992592 -1.960896
H  4.645981 -0.5313 -2.949575
H  0.512738 -1.056617 -0.907937
H  0.206746 -2.710118 3.097396
H  -2.292874 -3.108166 2.78337
H  0.381757 2.719752 2.047393
H  0.672524 1.689568 -2.153544
H  -2.131275 3.022344 1.792752
H  -1.824058 1.9624 -2.40011
H  -5.072518 2.513063 -1.703476
