program: Gaussian 09
title: 000173755
version: EM64L-G09RevD.01
frameworkgroup: C1[X(C24H30N2O2)]
method: RPBEPBE
basis: SDD
operation: Freq
keyword: #p
keyword: freq=noraman
keyword: PBEPBE/SDD
title: #p freq=noraman PBEPBE/SDD
converged: YES YES NO NO
title: Mulliken charges:
elementType: O O N N C C C C C C C C C C C C C C C C C C C C C C C C H H H H H H H H H H H H H H H H H H H H H H H H H H H H H H
charge: -0.205752 -0.259724 -0.064953 -0.301211 0.246819 -0.439566 -0.489579 -0.413677 -0.388663 0.178692 -0.341581 0.367683 0.227805 -0.581433 -0.785682 -0.488734 0.500984 -0.356743 -0.350898 -0.679612 -0.218248 -0.223184 -0.411401 -0.415599 -0.234177 -0.229516 -0.228186 -0.243965 0.244061 0.198352 0.241389 0.204882 0.201910 0.246345 0.212801 0.202183 0.196514 0.222592 0.208736 0.220362 0.236721 0.226103 0.273326 0.238100 0.246328 0.247837 0.251456 0.210607 0.219718 0.243432 0.233104 0.233362 0.231019 0.232502 0.234688 0.222829 0.222460 0.226378
chargesum: 0.00000
title: Mulliken charges with hydrogens summed into heavy atoms:
elementType: O O N N C C C C C C C C C C C C C C C C C C C C C C C C
charge: -0.205752 -0.259724 -0.064953 -0.301211 0.246819 0.002847 -0.043308 0.034578 0.026321 0.178692 0.077526 0.367683 0.227805 -0.152334 -0.049532 -0.004305 0.500984 -0.108906 -0.099442 -0.005855 0.014856 0.010178 -0.180383 -0.183098 0.000511 -0.006687 -0.005725 -0.017587
polarizability: 3.23710767e+02 -1.59529863e+01 2.62479580e+02 -6.96342290e+00 -1.26652252e+01 2.33676408e+02
1716.lowfreq: -4.1367 -0.0009 -0.0008 0.0005 3.0114 6.9660 15.6531 16.9730 20.0148
frequency: 15.5626 16.6366 19.5815 28.5153 46.9783 50.6050 56.8002 68.2007 82.1788 91.9143 93.5127 110.6058 125.3128 130.9985 142.7680 174.3574 189.3662 204.2948 215.0836 238.0659 260.5131 263.0301 284.2547 287.9871 302.5010 320.9979 334.2103 355.1117 385.4777 392.5805 404.0805 407.7877 410.9185 450.6657 482.0939 489.6471 500.1377 509.3903 545.4620 573.2728 581.8410 605.0088 617.7848 620.6473 636.8230 645.1564 668.5044 703.3240 705.3536 748.2297 757.6420 765.0481 790.5142 797.8651 802.5957 812.8333 825.6368 850.7521 853.7308 865.1399 915.6145 921.6001 924.3002 950.6211 969.8069 975.5163 976.0753 978.1554 989.7376 990.1054 992.4964 997.4220 998.5263 1010.9521 1014.9070 1022.7414 1026.5827 1027.0487 1034.1778 1045.6095 1061.4634 1075.5844 1078.9685 1085.8862 1091.3535 1104.3782 1119.8782 1142.4237 1157.6537 1170.6046 1171.6682 1172.6089 1178.5030 1186.4956 1192.8686 1210.1792 1217.7718 1231.0039 1250.4739 1257.5503 1273.1126 1283.9302 1289.4076 1300.2869 1303.7217 1308.8055 1323.5644 1326.9709 1341.1844 1342.9777 1361.0353 1364.7767 1366.6830 1371.2513 1382.3158 1392.9713 1395.0403 1434.6363 1439.4485 1440.4293 1443.8168 1447.4800 1456.5419 1462.1169 1465.9579 1468.2704 1476.0164 1478.6572 1481.6443 1482.1763 1484.2955 1493.3405 1567.6183 1588.5197 1592.5180 1606.5294 1611.4743 1614.2049 2856.2527 2866.4142 2945.1783 2982.9088 2992.5107 2992.8600 2994.7135 2997.1173 2998.5043 3019.0392 3024.2487 3037.5932 3039.9868 3058.8735 3063.9280 3072.9741 3087.4987 3091.1551 3107.1336 3113.3422 3114.3735 3117.4332 3129.5475 3130.4118 3135.1802 3141.8448 3147.2077 3155.1359 3160.8537 3169.4694
redmass: 3.7377 4.7463 4.4238 3.9787 2.7160 3.8043 4.2157 4.0728 2.0556 2.7746 3.4931 4.3886 1.5210 4.6072 3.2453 3.0406 1.4854 2.6921 3.3990 2.8731 3.0109 3.5605 3.2291 3.6460 3.4547 3.0467 2.5052 2.8769 2.2841 5.9065 2.8424 3.6363 2.8347 4.5861 3.2715 3.3925 3.3939 3.0734 3.5166 3.2933 3.5540 3.7549 6.3599 5.3157 3.5747 3.6489 4.4854 1.7109 1.7704 2.3215 2.3883 2.6441 1.2221 1.5244 2.3061 1.5590 3.3783 1.2442 1.2466 2.8310 1.6197 2.1030 1.6216 2.4040 2.1483 1.4166 2.3926 1.3960 4.6831 5.7987 1.3997 2.0320 1.5518 1.8255 1.7048 1.8886 2.0925 1.9948 1.8007 3.2327 2.3253 1.5459 1.6310 1.6610 2.7556 2.1205 3.0922 2.9312 2.5796 1.5520 1.2168 1.0662 1.1283 1.1152 1.1143 1.9856 2.3142 3.0248 1.2676 1.4013 1.5803 1.4138 1.6324 1.5651 1.4230 1.5403 1.3435 1.2775 1.3390 1.3559 1.9456 1.3198 1.4555 7.7482 7.3484 1.3825 1.2147 2.1129 2.1661 1.0946 1.1220 1.0728 1.0991 1.0523 1.0909 1.0423 1.0912 2.2301 1.2177 1.0871 1.8996 1.0989 7.2486 6.3153 6.0509 6.2909 9.9312 6.1788 1.0712 1.0704 1.0633 1.0623 1.0593 1.0395 1.0634 1.0368 1.0597 1.0881 1.0925 1.0966 1.0872 1.1022 1.1015 1.1010 1.0956 1.1004 1.0997 1.0866 1.0870 1.1006 1.0850 1.0909 1.0882 1.0959 1.0926 1.0970 1.1015 1.1017
irintensity: 0.0486 0.3375 0.2309 0.2375 0.0322 0.2986 0.2051 0.0655 1.7827 0.5176 1.3891 1.1016 1.9017 2.8905 6.1436 1.5853 0.3057 1.2766 2.7813 0.9324 1.4052 2.0625 1.6209 12.4957 1.0685 6.5782 1.4294 1.8614 3.7961 22.1864 0.0232 0.6325 0.0119 3.6368 10.5360 1.4795 5.6655 20.2601 1.7250 4.4951 18.8998 8.6842 0.0761 3.5953 0.8370 10.4582 1.6517 57.7555 49.6665 29.0505 21.8257 22.0887 0.9941 8.3690 8.2754 3.0300 4.8082 0.2370 0.0166 3.1891 1.9793 6.0290 3.2196 9.9538 7.1801 0.1581 11.4574 0.2847 6.0015 0.1501 0.9945 21.1308 9.0221 6.8627 4.7139 5.7299 8.2502 3.6120 3.7700 41.8550 14.3865 12.3492 1.8186 12.9278 11.1750 62.9556 26.5808 35.5746 3.3256 24.4540 8.2886 1.1086 2.0903 0.1747 3.2062 9.2319 3.2855 89.8029 8.7331 42.6893 38.6647 2.7514 15.6068 35.7798 6.7884 8.9151 1.6554 1.1401 3.1723 48.5552 61.6129 82.2028 3.4591 2.8465 0.4772 0.7497 31.9500 7.8479 6.6470 7.9235 30.7424 9.9530 1.4679 7.6747 3.3531 15.5269 7.1992 59.1237 1.0913 22.0947 23.2819 32.2172 205.6523 4.6416 1.6173 0.2491 136.3283 11.9837 50.5295 92.3949 43.5156 21.6450 22.6202 7.8306 14.8024 33.3599 29.4958 8.0483 52.1260 5.7727 35.5782 28.7557 18.7228 15.0751 18.3183 31.6293 22.1584 11.6525 6.1484 11.6115 2.7824 12.3230 0.8316 46.3741 19.5213 22.9508 27.0326 14.6447
temp: 298.150 k
press: 1.00000 atm
elementType: 8 8 7 7 6 6 6 6 6 6 6 6 6 6 6 6 6 6 6 6 6 6 6 6 6 6 6 6 1 1 1 1 1 1 1 1 1 1 1 1 1 1 1 1 1 1 1 1 1 1 1 1 1 1 1 1 1 1
symmnumber: 1
zpe: 1277866.7 jmol-1
zpe.correction: 0.486714 hartree
zpe.thermalcorrener: 0.514223 hartree
zpe.thermalcorrenthalpy: 0.515167 hartree
zpe.thermalcorrgfe: 0.425325 hartree
zpe.sumelectzpe: -1190.420187 hartree
zpe.sumelectthermal: -1190.392678 hartree
zpe.sumelectthermalent: -1190.391733 hartree
zpe.sumelectthermalfe: -1190.481575 hartree
dipole: -2.0010 5.5695 1.3859
dipole: 6.0782
quadrupole: -156.9939 -178.2348 -154.0479
quadrupole: -16.5450 -5.1674 -6.6388
quadrupole: 6.0983 -15.1426 9.0443 -16.5450 -5.1674 -6.6388
hfenergy: -1190.9069003 hartree
pointgroup: C01 [X(C24H30N2O2)]
dipole: -0.8453081 -2.2369293 0.0074475 debye
polarizability: 324.5107387|15.5124912|253.8040243|2.9631259|-17.9686111|241.5519909 unknown
InChI: InChI=1S/C24H30N2O2/c1-3-23(28)26(22-12-8-5-9-13-22)24(20(2)27)15-18-25(19-16-24)17-14-21-10-6-4-7-11-21/h4-13H,3,14-19H2,1-2H3
charge 0 multiplicity 1
58 atoms
O  -0.700358 3.01281 -1.120211
O  -3.504434 2.481016 0.14884
N  1.507019 0.280355 0.271296
N  -2.787981 0.288186 -0.01665
C  -1.385417 0.801389 -0.293699
C  -0.701138 1.168585 1.056142
C  -0.540498 -0.295932 -1.009445
C  0.819378 1.41322 0.954816
C  0.949214 0.092078 -1.090917
C  -1.471505 2.028342 -1.263512
C  2.979611 0.457806 0.271836
C  -3.039265 -1.129051 0.169512
C  -3.769437 1.241438 0.268128
C  3.749337 -0.859939 -0.018265
C  -2.338612 1.903929 -2.515636
C  -5.15276 0.745383 0.699732
C  5.253621 -0.659345 0.083999
C  -3.382616 -1.938429 -0.941457
C  -2.956122 -1.709393 1.45934
C  -6.221192 1.850379 0.605442
C  -3.635815 -3.316393 -0.765083
C  -3.210116 -3.088442 1.633663
C  6.003619 -0.198408 -1.029441
C  5.934797 -0.881781 1.308862
C  -3.549404 -3.8952 0.523067
C  7.393774 0.032908 -0.924488
C  7.325033 -0.652495 1.419866
C  8.060176 -0.193091 0.30238
H  -1.188134 2.068372 1.471551
H  -0.865694 0.320482 1.748275
H  -0.607229 -1.234162 -0.430219
H  -0.937477 -0.496291 -2.022654
H  1.231769 1.493205 1.978759
H  1.000799 2.37735 0.431265
H  1.085771 1.00905 -1.71838
H  1.489866 -0.73103 -1.591094
H  3.308278 1.243073 -0.45609
H  3.275035 0.815793 1.276383
H  3.489815 -1.226691 -1.029319
H  3.400749 -1.6191 0.705816
H  -1.681518 1.831185 -3.402748
H  -3.013959 1.033976 -2.492632
H  -2.935262 2.825032 -2.616615
H  -5.078883 0.37832 1.743537
H  -5.439874 -0.136547 0.097256
H  -3.451432 -1.48204 -1.935049
H  -2.6962 -1.080319 2.317516
H  -7.186593 1.483558 0.997526
H  -6.368596 2.173324 -0.439856
H  -5.915577 2.739286 1.181362
H  -3.901511 -3.935709 -1.628777
H  -3.143075 -3.530743 2.633623
H  5.494338 -0.025837 -1.986261
H  5.370586 -1.242066 2.178491
H  -3.746306 -4.964048 0.659816
H  7.956575 0.385983 -1.796353
H  7.83448 -0.834613 2.373217
H  9.138551 -0.016618 0.385533
