program: Gaussian 09
title: 000173648
version: EM64L-G09RevD.01
frameworkgroup: C1[X(C15H23NO3)]
method: RPBEPBE
basis: SDD
operation: Freq
keyword: #p
keyword: freq=noraman
keyword: PBEPBE/SDD
title: #p freq=noraman PBEPBE/SDD
converged: YES YES NO NO
title: Mulliken charges:
elementType: O O O N C C C C C C C C C C C C C C C H H H H H H H H H H H H H H H H H H H H H H H
charge: -0.456387 -0.296113 -0.295564 -0.350590 -0.039139 -0.176324 -0.574378 -0.555418 0.181907 0.146628 -0.063713 0.142771 0.160372 -0.366120 -0.371019 -0.687245 -0.713628 -0.516277 -0.515316 0.220643 0.229862 0.261004 0.225284 0.266771 0.228791 0.235966 0.220520 0.343617 0.245350 0.246081 0.213372 0.203492 0.228955 0.234868 0.209333 0.197078 0.214895 0.219511 0.232542 0.215871 0.217766 0.233980
chargesum: 0.00000
title: Mulliken charges with hydrogens summed into heavy atoms:
elementType: O O O N C C C C C C C C C C C C C C C
charge: -0.112770 -0.296113 -0.295564 -0.114624 0.181503 0.053538 -0.088089 -0.059856 0.181907 0.146628 0.156807 0.142771 0.160372 -0.120770 -0.124938 -0.041426 -0.072349 0.150672 0.152301
polarizability: 2.19287796e+02 -6.88590639e+00 1.97378690e+02 8.62183065e+00 7.83514754e-01 1.21942577e+02
1716.lowfreq: -22.0126 -7.7282 -6.0760 -2.9363 -0.0002 0.0005 0.0008 20.4481 34.4908
frequency: -21.4651 19.5926 34.4242 43.4859 71.3238 79.6310 86.7726 104.8126 141.7015 149.6122 158.3477 191.5947 193.7447 201.6020 216.3596 239.4454 242.2755 269.2476 282.6732 316.8106 326.9943 350.7298 365.8659 386.6957 406.4172 443.1530 467.2697 477.2361 485.5162 526.3433 545.3696 567.2980 595.0355 626.3508 677.1820 688.5319 742.3394 752.7540 819.0901 829.4288 840.6796 893.9051 896.4049 909.0655 919.6634 937.4586 941.2299 944.4802 980.4505 1009.2532 1023.4754 1027.1065 1043.1940 1106.4631 1109.0219 1109.8897 1120.3454 1133.1569 1134.2091 1143.7828 1150.5508 1154.1800 1176.8241 1179.7206 1184.9437 1196.1874 1206.9948 1239.2647 1252.1194 1286.7415 1292.4638 1298.5112 1316.0456 1321.0160 1342.6738 1363.5325 1369.3918 1378.7477 1390.5751 1396.6431 1422.5882 1424.7157 1435.1827 1446.8126 1457.6932 1458.3155 1458.8320 1460.6021 1461.6486 1464.8143 1468.1947 1472.0780 1475.8698 1480.3227 1485.5959 1588.5464 1592.2524 2873.9776 2951.6299 2952.8576 2957.3964 2967.4237 2968.5263 2973.1047 2981.8372 2997.1008 3036.9539 3038.1789 3045.8272 3061.0160 3061.4776 3070.9761 3071.9256 3092.6121 3111.2729 3113.0634 3142.5519 3165.0444 3392.9608 3573.8310
redmass: 2.7974 2.6527 3.6566 2.8661 4.2750 3.5816 3.0255 3.1647 1.1852 1.1985 2.5682 1.2623 2.2137 2.7527 4.3752 1.3476 2.7975 1.7313 2.6862 2.3929 2.6172 2.4054 3.1787 6.4836 4.4637 2.8683 3.1382 3.9848 3.0513 3.2967 4.0076 3.7330 3.8375 3.0976 3.6151 5.1578 2.2517 3.3874 2.6124 1.5296 1.9676 3.6029 3.1228 1.2706 2.0755 2.5067 1.3871 1.3791 5.4864 4.2428 2.4100 3.5622 2.3752 2.0568 1.2615 1.2464 1.6398 2.1351 1.4187 1.4846 1.3739 1.4347 1.6186 2.5195 1.7878 2.4597 1.8672 4.0746 1.3611 1.3479 1.5920 1.7067 1.3745 1.3439 1.4553 3.1720 1.4652 1.4805 1.2265 1.3579 3.4392 1.4065 1.1655 1.1891 1.0853 1.0555 1.1129 1.6816 1.1186 1.0646 1.1027 1.0834 1.1213 1.0852 1.0527 6.7686 8.7558 1.0802 1.0331 1.0319 1.0671 1.0732 1.0420 1.0385 1.0701 1.0835 1.1038 1.1039 1.0919 1.0935 1.0984 1.0994 1.0977 1.1001 1.1002 1.1001 1.0876 1.0975 1.0724 1.0663
irintensity: 0.5079 10.0024 1.0928 3.3721 8.5790 5.0013 0.3143 1.3036 0.5595 0.8504 4.4391 0.0491 4.2638 4.0932 7.2028 1.7513 4.5101 64.4433 65.6619 45.5036 25.0873 3.4865 5.3766 0.2636 12.9191 1.6761 3.0305 3.8686 1.6469 16.2012 8.6338 3.2129 11.2597 12.2091 30.2928 10.0369 21.8937 11.9544 4.3346 32.7305 13.6769 2.0532 1.5460 5.5208 9.2572 29.3910 0.7932 0.5620 62.9832 18.2657 128.0242 62.6851 4.4161 15.5370 0.6863 0.3195 3.3629 23.9411 13.2239 0.7055 3.8392 0.2145 5.5986 83.2058 51.0730 120.1445 23.6134 2.3219 17.3947 2.0538 9.0220 21.8957 4.3200 1.9448 16.0112 5.9994 17.9529 19.5435 23.4748 4.8090 0.8074 34.9180 0.0177 18.7348 15.1911 23.7424 3.9798 106.2053 3.4682 2.1403 1.7786 10.8828 5.9062 7.5703 14.0694 4.3835 0.3434 45.7267 75.3015 49.5429 23.0340 5.8790 38.3245 32.3233 48.6611 20.4298 46.3084 55.2428 13.6120 12.3436 4.9639 45.3753 82.9408 35.6997 35.1256 31.9923 7.2043 11.3474 2.7524 6.6231
temp: 298.150 k
press: 1.00000 atm
elementType: 8 8 8 7 6 6 6 6 6 6 6 6 6 6 6 6 6 6 6 1 1 1 1 1 1 1 1 1 1 1 1 1 1 1 1 1 1 1 1 1 1 1
symmnumber: 1
zpe: 930090.8 jmol-1
zpe.correction: 0.354253 hartree
zpe.thermalcorrener: 0.374503 hartree
zpe.thermalcorrenthalpy: 0.375447 hartree
zpe.thermalcorrgfe: 0.304681 hartree
zpe.sumelectzpe: -864.296742 hartree
zpe.sumelectthermal: -864.276492 hartree
zpe.sumelectthermalent: -864.275548 hartree
zpe.sumelectthermalfe: -864.346314 hartree
dipole: -0.9095 1.0596 -0.0377
dipole: 1.3969
quadrupole: -105.6887 -112.0299 -114.2951
quadrupole: 0.9679 6.0846 -7.6647
quadrupole: 4.9825 -1.3587 -3.6239 0.9679 6.0846 -7.6647
hfenergy: -864.650995 hartree
pointgroup: C01 [X(C15H23N1O3)]
dipole: -0.351351 0.4225054 -0.008915 debye
polarizability: 219.2565816|-7.2500168|197.5935027|7.4498301|1.0471031|121.7589795 unknown
InChI: InChI=1S/C15H23NO3/c1-9(2)16-12-7-10-11(8-13(12)17)15(19-4)6-5-14(10)18-3/h5-6,9,12-13,16-17H,7-8H2,1-4H3
charge 0 multiplicity 1
42 atoms
O  -1.478825 -3.049015 -0.780684
O  0.597147 3.072061 0.306197
O  3.470451 -1.754068 -0.226053
N  -3.00692 -0.704328 -0.264054
C  -1.561386 -0.694312 0.064674
C  -0.841232 -1.716592 -0.845613
C  -0.92306 0.687176 -0.185079
C  0.611203 -1.903398 -0.397902
C  0.596256 0.646942 -0.073916
C  1.319614 -0.575875 -0.16645
C  -3.888731 0.309526 0.382123
C  1.316928 1.852868 0.14115
C  2.735995 -0.545841 -0.057982
C  2.722118 1.8689 0.254639
C  3.438821 0.658873 0.148539
C  -3.872806 0.270614 1.935366
C  -5.319046 0.114685 -0.16141
C  0.453474 3.858996 -0.930837
C  3.790686 -2.449755 1.032646
H  -1.359221 -0.990137 1.124576
H  -0.888569 -1.329505 -1.886526
H  -1.307228 1.446309 0.519129
H  -1.228471 1.022562 -1.199314
H  1.170039 -2.505029 -1.135261
H  0.595408 -2.501878 0.536027
H  -3.3809 -1.650041 -0.084221
H  -3.534714 1.306733 0.056513
H  -2.217481 -3.071916 -1.439136
H  3.233646 2.819875 0.435559
H  4.531731 0.636496 0.210473
H  -4.512238 1.070223 2.3540
H  -4.254522 -0.700947 2.304818
H  -2.852519 0.412417 2.336288
H  -5.323547 0.178373 -1.263387
H  -6.004119 0.881543 0.242706
H  -5.717349 -0.877945 0.129074
H  -0.118259 3.299814 -1.698155
H  1.444183 4.131977 -1.344824
H  -0.095933 4.769994 -0.646957
H  2.870378 -2.755097 1.568921
H  4.401886 -1.806868 1.69654
H  4.366114 -3.343007 0.744505
