program: Gaussian 09
title: 000173520
version: EM64L-G09RevD.01
frameworkgroup: C1[X(C7H11N3O)]
method: RPBEPBE
basis: SDD
operation: Freq
keyword: #p
keyword: freq=noraman
keyword: PBEPBE/SDD
title: #p freq=noraman PBEPBE/SDD
converged: NO YES NO NO
title: Mulliken charges:
elementType: O N N N C C C C C C C H H H H H H H H H H H
charge: -0.428148 -0.347603 -0.065023 -0.059471 -0.019936 -0.717286 -0.674711 0.047344 -0.339360 -0.383188 0.268920 0.236656 0.316075 0.222467 0.204748 0.232336 0.250878 0.205936 0.201088 0.258557 0.233345 0.356375
chargesum: 0.00000
title: Mulliken charges with hydrogens summed into heavy atoms:
elementType: O N N N C C C C C C C
charge: -0.071773 -0.031527 -0.065023 -0.059471 0.216720 -0.057735 -0.016808 0.047344 -0.080803 -0.149844 0.268920
polarizability: 1.54591178e+02 -4.29889485e+00 9.47345485e+01 -5.70792674e-02 7.53078078e+00 6.07899774e+01
1716.lowfreq: -9.2482 -6.2203 -0.0006 0.0002 0.0006 8.9406 46.3640 67.2308 118.8791
frequency: 46.2527 67.1972 118.8744 131.6769 213.5696 247.6929 282.4899 302.2581 326.2485 351.5692 385.4412 412.9255 424.4269 470.0605 502.8302 528.8584 565.1303 633.4321 759.1675 779.7392 822.5316 859.9810 886.3293 917.6094 921.9149 944.2712 983.2948 991.3611 1108.9978 1136.2148 1150.8302 1185.0778 1205.7386 1256.0090 1280.1665 1306.9725 1347.3829 1355.7237 1370.4832 1372.1851 1391.7568 1441.2994 1461.6509 1468.3224 1478.9131 1487.1369 1512.5413 1534.1816 1592.1993 2975.5275 2980.1500 3014.2204 3069.0244 3079.2870 3092.4762 3093.0660 3096.7808 3150.0495 3563.2542 3573.9841
redmass: 3.1336 4.5734 4.2383 4.3439 1.0263 1.1105 3.1308 1.1362 3.3671 5.8986 3.2508 4.2612 3.1855 2.8751 1.3532 1.8799 6.3016 8.6638 8.6555 9.8977 3.1858 3.2426 1.5219 1.2192 1.4138 1.4252 2.2081 3.4559 2.1930 1.9805 1.7323 2.1186 2.4998 1.9358 3.0175 1.5328 1.2945 2.2987 1.5206 1.2272 1.2392 1.8512 1.0663 1.0468 1.0825 1.0548 6.5442 3.8280 6.5523 1.0372 1.0363 1.0844 1.0987 1.0991 1.0997 1.0919 1.0998 1.0931 1.0767 1.0663
irintensity: 0.3813 1.4367 0.7643 0.4450 0.1043 0.1255 5.0025 157.2544 6.3853 4.4212 6.3642 2.1886 5.2573 15.8887 66.9745 36.3956 5.3274 3.1551 35.1011 13.9207 3.0828 0.7231 19.8684 4.5244 8.5260 1.4966 1.3745 1.0298 138.7800 88.7046 72.1732 22.6012 57.3084 13.9337 49.7312 4.6812 24.2297 49.8585 2.1247 25.1109 24.5907 31.3694 17.7866 4.3541 31.3572 19.8110 299.7363 329.1260 149.5986 25.8844 36.4350 4.3441 10.2383 67.6173 31.3174 41.9189 29.9891 16.4253 59.5930 30.2723
temp: 298.150 k
press: 1.00000 atm
elementType: 8 7 7 7 6 6 6 6 6 6 6 1 1 1 1 1 1 1 1 1 1 1
symmnumber: 1
zpe: 466595.9 jmol-1
zpe.correction: 0.177717 hartree
zpe.thermalcorrener: 0.188917 hartree
zpe.thermalcorrenthalpy: 0.189861 hartree
zpe.thermalcorrgfe: 0.140696 hartree
zpe.sumelectzpe: -511.977005 hartree
zpe.sumelectthermal: -511.965805 hartree
zpe.sumelectthermalent: -511.964861 hartree
zpe.sumelectthermalfe: -512.014026 hartree
dipole: -0.7905 -1.6041 -0.5025
dipole: 1.8576
quadrupole: -56.8494 -63.8680 -67.4932
quadrupole: -9.2599 -1.9642 1.2414
quadrupole: 5.8875 -1.1311 -4.7564 -9.2599 -1.9642 1.2414
hfenergy: -512.1547216 hartree
pointgroup: C01[X(C7H11N3O1)]
dipole: 0.3175513 -0.6327777 0.1812761 debye
dipolederiv: -1.5409466 -0.2652647 0.0625383 -0.3226914 -0.0977437 -0.090216 0.056406 -0.0908232 -0.3961584 -1.8089931 -0.0594715 0.042687 -0.2741442 -0.2790405 -0.1439182 -0.0613902 -0.1485251 -0.4692182 -0.9404278 -0.3180605 0.0858772 0.3798989 -0.3139225 0.0115694 -0.1199219 0.0103188 -0.250055 -0.8787703 0.1817008 -0.0494811 -0.6888476 -0.3199601 0.0281709 0.1825806 0.0206517 -0.2317683 0.7687875 -0.1544678 -0.0070208 -0.4486295 0.3314479 0.0827776 0.163955 0.0956585 0.3269122 -0.103518 -0.011465 -0.0409809 0.0227586 0.0310654 -0.0652191 -0.0574041 -0.0680584 0.0595885 -0.1052286 -0.0259051 -0.0119252 0.0910249 -0.0163646 -0.1130657 -0.0346242 -0.156009 -0.0603994 2.1227248 0.2336787 -0.0709774 0.6124413 0.0738302 0.034783 -0.1024221 0.0400415 0.176144 0.3524327 0.2561115 -0.0644701 -0.2519252 0.4492805 -0.1341586 0.0798892 -0.1217104 -0.0123595 0.3598079 -0.3094463 0.0856192 0.3162742 0.374432 -0.1236915 -0.0691676 -0.1229862 -0.061608 1.1793719 0.3436647 -0.0746927 0.3627187 -0.405503 0.1437423 -0.0739109 0.1458845 0.0792273 0.0189508 -0.0412272 0.0653227 0.0500578 -0.0072746 0.0616679 0.0093063 0.0486864 -0.062359 0.1611809 0.0209516 0.006945 0.0929991 0.1724319 0.0412453 -0.0034078 0.0659922 0.2965781 -0.1025846 0.082932 -0.0382748 0.1406755 -0.0109954 0.0410507 -0.029731 0.0216092 0.099798 0.0682202 -0.0304322 0.0097298 -0.0879385 -0.0152183 0.0919328 0.0737892 0.1406554 -0.0641357 0.1016323 0.0196587 0.0456882 -0.0178273 -0.0001628 -0.1299796 0.0193395 -0.1236059 -0.0827898 -0.0165863 -0.1112012 -0.0803553 -0.1099056 0.0392413 -0.0430257 -0.0800195 -0.0272578 0.0600048 -0.0902551 0.1444878 -0.0179737 0.1963519 -0.0233554 0.0155497 -0.0150528 0.048522 0.0585991 0.0671082 -0.0216471 0.0734404 -0.077209 -0.0139333 0.1303191 0.0677244 0.0640912 -0.0659347 -0.006736 0.0789335 -0.0222868 0.1012396 0.0350189 0.0249556 -0.0281788 0.0240992 0.1162547 0.0103029 -0.0959623 0.0242773 -0.125443 -0.0772963 0.0520723 0.0325325 0.0482632 0.114653 0.3835264 0.0824314 -0.0236864 0.0381207 0.0740224 0.0834379 -0.0102918 0.084502 0.3690263 unknown
polarizability: 154.5160814|4.678679|95.1046589|-0.8313479|-6.8542909|60.4949635 unknown
InChI: InChI=1S/C7H11N3O/c1-5(2)10-7-8-3-6(11)4-9-7/h3-5,10-11H,1-2H3
charge 0 multiplicity 1
22 atoms
O  -3.909191 -0.399051 0.095834
N  1.493881 0.686862 -0.048559
N  -0.722004 1.400613 -0.308502
N  -0.208188 -0.920701 0.297748
C  2.586284 -0.274219 0.207352
C  3.842198 0.505139 0.645519
C  2.857941 -1.165742 -1.02923
C  0.156555 0.368594 -0.02013
C  -2.042735 1.106019 -0.259565
C  -1.545506 -1.177016 0.341396
C  -2.518652 -0.189558 0.069737
H  2.248507 -0.929594 1.032038
H  1.713292 1.647897 -0.315007
H  4.667984 -0.194358 0.862762
H  4.185205 1.187084 -0.156979
H  3.645678 1.102848 1.553453
H  1.937513 -1.699735 -1.319905
H  3.637161 -1.916192 -0.800242
H  3.202334 -0.555831 -1.884969
H  -2.748764 1.91183 -0.486369
H  -1.832302 -2.207082 0.597813
H  -4.120792 -1.334907 0.338506
