program: Gaussian 09
title: 000173530
version: EM64L-G09RevD.01
frameworkgroup: C1[X(C12H20O2)]
method: RPBEPBE
basis: SDD
operation: Freq
keyword: #pfreq=noraman
keyword: PBEPBE/SDD
title: #p freq=noraman PBEPBE/SDD
converged: YES YES NO NO
title: Mulliken charges:
elementType: O O C C C C C C C C C C C C H H H H H H H H H H H H H H H H H H H H
charge: -0.274407 -0.266308 -0.480380 -0.249491 -0.161976 0.191122 -0.441044 -0.440557 -0.154408 -0.207229 0.180793 -0.767670 -0.666287 -0.668666 0.199501 0.220898 0.228052 0.226966 0.222033 0.210292 0.215241 0.207333 0.203101 0.252566 0.217502 0.246116 0.208080 0.238997 0.218869 0.218903 0.224334 0.215655 0.221577 0.210490
chargesum: 0.00000
title: Mulliken charges with hydrogens summed into heavy atoms:
elementType: O O C C C C C C C C C C C C
charge: -0.274407 -0.266308 -0.059982 0.205527 0.060058 0.191122 -0.015511 -0.030122 0.063094 0.045337 0.180793 -0.074478 -0.004180 -0.020943
polarizability: 1.77035800e+02 4.82455075e+00 1.46408169e+02 -1.09677913e+01 5.81488832e+00 1.04840728e+02
1716.lowfreq: -4.4657 -0.0003 0.0003 0.0004 4.3254 4.9885 15.2843 21.4007 31.8465
frequency: 15.1727 21.3154 31.4555 39.4086 59.7997 86.7712 107.7157 116.2319 126.0205 140.9807 176.9541 196.2829 208.1561 238.3102 266.9242 285.6871 317.0089 344.0411 385.4903 399.3386 444.2890 458.5644 474.8363 508.2367 646.3390 700.6931 766.9891 769.8701 780.9480 811.4357 842.8054 881.2857 897.9098 913.0067 930.7667 969.6435 977.1271 987.6292 1020.6429 1036.5597 1047.6493 1051.1062 1065.7641 1067.7310 1074.4895 1108.0673 1146.3432 1163.8827 1199.8027 1220.7589 1228.0549 1242.9411 1253.6739 1278.5760 1293.4617 1305.6634 1315.6454 1351.6086 1352.6401 1367.4469 1385.3019 1387.9938 1404.3323 1444.1782 1457.7371 1462.0472 1464.7777 1471.2006 1473.5200 1474.6474 1475.2626 1484.4751 1484.8298 1596.2917 1665.8141 1692.0438 2964.2368 2965.5415 2965.9578 2976.5819 2982.4990 2989.9048 3001.5049 3024.5198 3040.4768 3043.5839 3063.7490 3066.2328 3067.2201 3073.0576 3077.1153 3080.7783 3080.9621 3086.6725 3093.3493 3102.2454
redmass: 3.5712 3.0986 3.0421 2.8409 3.1737 3.2633 2.6140 1.3569 2.4893 2.0057 1.7394 2.0428 1.7024 1.3861 2.0994 3.2656 2.5128 3.5197 3.6865 2.5429 3.2855 2.7394 2.2158 3.2021 3.2427 5.1408 1.3264 1.6672 1.8020 2.0469 2.2322 1.6780 2.0310 2.3642 1.3250 1.5911 1.4868 1.9804 1.9115 2.0248 1.4510 2.1026 2.6433 1.8623 1.8197 2.2006 1.9263 2.6391 1.3514 1.7318 1.4217 1.1920 1.2899 1.2360 1.2603 1.4614 1.4062 1.4512 1.4177 1.5133 1.2028 1.2227 1.2818 1.0952 1.0607 1.0596 1.0740 1.0750 1.0767 1.0433 1.0439 1.0639 1.0643 11.4815 7.0510 6.6109 1.0618 1.0637 1.0653 1.0353 1.0350 1.0371 1.0580 1.0971 1.0955 1.0935 1.0971 1.0971 1.1009 1.0986 1.0931 1.0994 1.0992 1.0998 1.0910 1.0983
irintensity: 0.1485 0.0661 1.1204 1.0464 0.6004 1.6564 0.0500 0.4836 0.7159 0.9088 1.0436 2.5035 1.3039 0.3512 3.7426 2.8637 0.6454 0.1354 1.1384 1.9540 13.1797 0.4744 3.2579 3.3165 7.6847 21.2409 3.6613 4.8536 9.0217 2.7488 1.9633 2.3255 7.5101 33.3854 15.9146 53.2552 28.7953 3.2939 6.8534 25.8208 0.9042 1.9027 271.8002 5.5269 95.3579 3.3229 3.3205 101.0182 2.2527 105.1034 68.8218 0.4105 28.0058 2.0397 0.4721 15.2203 0.8187 2.4786 1.5225 2.1956 7.7159 9.7653 21.9880 17.3379 4.9641 15.1205 7.9882 6.3217 13.6262 9.7048 13.2605 13.0002 12.1135 171.4170 45.9835 0.4228 42.8750 37.8573 21.2624 33.3836 42.9512 16.4324 36.5620 9.4061 9.7420 9.3119 3.5152 10.9098 15.9792 1.4058 125.6732 63.3551 46.3704 34.1985 19.5022 33.9847
temp: 298.150 k
press: 1.00000 atm
elementType: 8 8 6 6 6 6 6 6 6 6 6 6 6 6 1 1 1 1 1 1 1 1 1 1 1 1 1 1 1 1 1 1 1 1
symmnumber: 1
zpe: 766139.9 jmol-1
zpe.correction: 0.291807 hartree
zpe.thermalcorrener: 0.309518 hartree
zpe.thermalcorrenthalpy: 0.310463 hartree
zpe.thermalcorrgfe: 0.242663 hartree
zpe.sumelectzpe: -618.581975 hartree
zpe.sumelectthermal: -618.564264 hartree
zpe.sumelectthermalent: -618.563319 hartree
zpe.sumelectthermalfe: -618.631119 hartree
dipole: -0.6099 1.7645 0.9743
dipole: 2.1059
quadrupole: -78.8622 -85.8475 -85.9020
quadrupole: 7.3935 1.4744 -2.6970
quadrupole: 4.6750 -2.3103 -2.3648 7.3935 1.4744 -2.6970
hfenergy: -618.8737821 hartree
pointgroup: C01[X(C12H20O2)]
dipole: 0.2190929 -0.6839009 0.4131752 debye
polarizability: 177.2763421|4.3803091|145.5495476|10.670856|-7.8780414|105.4588071 unknown
InChI: InChI=1S/C12H20O2/c1-4-6-7-8-10-14-12(13)11(3)9-5-2/h6-7,9H,4-5,8,10H2,1-3H3
charge 0 multiplicity 1
34 atoms
O  0.218558 1.007871 0.31164
O  -1.427878 2.030208 -0.981191
C  2.515054 1.784021 0.538717
C  1.122001 2.150196 0.007514
C  3.158835 0.630235 -0.203122
C  -1.859414 -0.154458 0.082455
C  -4.165326 -1.283565 -0.252256
C  4.208629 -1.691282 -0.363924
C  3.578559 -0.526169 0.37091
C  -3.128387 -0.202859 -0.428957
C  -1.057215 1.062223 -0.265998
C  -1.205456 -1.212858 0.94764
C  -5.4925 -0.719405 0.324377
C  3.386946 -2.997829 -0.209335
H  3.142639 2.695305 0.439731
H  2.446329 1.554578 1.6183
H  0.718251 3.054502 0.499664
H  1.120818 2.323914 -1.084525
H  3.280379 0.761439 -1.290912
H  -3.796587 -2.101625 0.391725
H  -4.379239 -1.733057 -1.24495
H  4.316889 -1.44209 -1.437043
H  5.232285 -1.868574 0.026972
H  -3.437765 0.659343 -1.040657
H  3.439388 -0.658995 1.456639
H  -0.276991 -1.584179 0.477044
H  -1.87658 -2.06899 1.124052
H  -0.907884 -0.792663 1.925302
H  -5.892325 0.086126 -0.318443
H  -6.257871 -1.513464 0.393661
H  -5.336392 -0.299937 1.334079
H  3.878544 -3.840242 -0.729949
H  2.372807 -2.874085 -0.630579
H  3.278599 -3.273935 0.856321
