program: Gaussian 09
title: 000173489
version: EM64L-G09RevD.01
frameworkgroup: C1[X(C12H20O2)]
method: RPBEPBE
basis: SDD
operation: Freq
keyword: #pfreq=noraman
keyword: PBEPBE/SDD
title: #p freq=noraman PBEPBE/SDD
converged: YES YES NO NO
title: Mulliken charges:
elementType: O O C C C C C C C C C C C C H H H H H H H H H H H H H H H H H H H H
charge: -0.286740 -0.249783 0.393434 0.383143 -0.177256 -0.521534 -0.518076 -0.470506 -0.473111 -0.426618 -0.794362 -0.798555 0.279673 -0.761298 0.269546 0.231042 0.209216 0.209296 0.229785 0.202083 0.211701 0.215551 0.201692 0.200100 0.206139 0.222098 0.212489 0.215196 0.218992 0.214013 0.215503 0.245878 0.245662 0.245608
chargesum: 0.00000
title: Mulliken charges with hydrogens summed into heavy atoms:
elementType: O O C C C C C C C C C C C C
charge: -0.286740 -0.249783 0.393434 0.383143 0.092290 -0.081277 -0.078994 -0.056722 -0.055867 -0.020379 -0.144580 -0.150046 0.279673 -0.024151
polarizability: 1.40627371e+02 6.06529977e-01 1.23562594e+02 1.54313111e-01 -1.18584441e+00 1.21529639e+02
1716.lowfreq: -24.7191 -14.5677 -9.9978 -0.0003 0.0007 0.0008 12.0519 25.9104 79.4436
frequency: -24.1857 25.4592 79.4425 84.7890 166.4350 189.5084 198.7940 202.3556 233.1729 250.2115 254.1792 274.4454 297.0657 339.9714 349.6938 389.0868 419.3849 474.1362 494.0493 533.1826 561.0535 564.8226 595.4139 609.5982 723.1965 783.7337 790.8622 856.1830 861.9948 864.7175 878.1134 912.4547 921.2518 931.7561 965.5864 979.0184 993.2582 995.7573 1004.2273 1028.7779 1040.6301 1071.5271 1084.1647 1096.6489 1111.7356 1151.2631 1160.3474 1200.0388 1204.3537 1207.8331 1228.1757 1250.9266 1266.1760 1270.3223 1292.2072 1301.9170 1304.6704 1330.9125 1343.5543 1349.2923 1355.2815 1383.0093 1386.2550 1388.1565 1452.5916 1453.1515 1455.9806 1463.3929 1465.2089 1468.5749 1471.4025 1472.0690 1478.1864 1479.8800 1490.8559 1650.0241 2967.0725 2967.9527 2974.2003 2978.4453 2987.9497 2989.3757 3003.7081 3006.8516 3008.0624 3024.5309 3035.4229 3041.2104 3048.9853 3060.2965 3061.5650 3063.4254 3066.2319 3070.0037 3095.6938 3141.7039
redmass: 1.0877 7.4326 2.6637 3.3426 1.9315 1.8446 1.2589 1.9929 1.9899 2.1381 2.5560 2.4412 2.2018 2.5304 2.4960 2.1338 3.0132 2.6119 3.5159 3.8045 3.1585 2.7720 3.8431 4.1956 2.1819 1.4012 2.7850 4.4311 2.6634 1.5123 2.0876 2.1689 1.6993 2.8709 2.3415 1.9092 1.4734 2.2494 2.7051 1.5596 1.6506 1.6480 1.5376 1.3740 1.8113 2.2695 2.3283 3.5881 1.2866 2.9574 1.6110 1.7290 1.5840 1.5769 1.4869 1.5914 1.5987 1.4175 1.3949 1.6064 1.5336 1.2442 1.2131 1.2166 1.0699 1.0755 1.0480 1.0767 1.0739 1.0602 1.0741 1.0665 1.0576 1.0609 1.0877 9.2455 1.0360 1.0366 1.0584 1.0596 1.0640 1.0592 1.0654 1.0371 1.0817 1.0986 1.1022 1.1033 1.1026 1.0987 1.1000 1.0990 1.1015 1.1003 1.0970 1.1011
irintensity: 1.3460 1.2496 2.1834 0.7715 0.0072 1.9793 0.9949 3.5227 0.9672 1.8937 0.6550 1.4941 1.8334 0.7484 0.0645 0.3158 0.0192 0.3811 8.4023 2.3379 2.9264 1.7204 0.2331 3.1369 3.3932 4.5913 2.7936 19.6528 1.0822 2.5756 0.0982 1.7434 0.2905 0.1761 18.0741 25.7207 5.7980 2.5087 174.3235 3.5127 7.2909 0.1852 2.2904 11.8834 0.1639 1.0747 0.3900 281.8398 0.5316 73.5530 0.8345 3.8528 0.0283 4.5664 0.3810 1.1997 1.0851 3.2294 0.8665 4.3793 7.0679 48.3473 20.2919 14.5107 17.0934 9.1019 19.3981 1.8111 6.0481 11.3714 3.6203 14.6660 4.9828 22.2627 13.9122 185.2806 33.5585 16.7478 14.8598 73.9964 44.3932 50.7066 35.1856 1.6931 28.9570 38.2667 3.9451 1.4758 47.7037 45.8342 12.9812 66.4427 19.6525 78.4242 8.5589 11.6407
temp: 298.150 k
press: 1.00000 atm
elementType: 8 8 6 6 6 6 6 6 6 6 6 6 6 6 1 1 1 1 1 1 1 1 1 1 1 1 1 1 1 1 1 1 1 1
symmnumber: 1
zpe: 779071.3 jmol-1
zpe.correction: 0.296733 hartree
zpe.thermalcorrener: 0.310684 hartree
zpe.thermalcorrenthalpy: 0.311628 hartree
zpe.thermalcorrgfe: 0.256599 hartree
zpe.sumelectzpe: -618.628497 hartree
zpe.sumelectthermal: -618.614545 hartree
zpe.sumelectthermalent: -618.613601 hartree
zpe.sumelectthermalfe: -618.668630 hartree
dipole: -1.2694 -0.2513 1.7284
dipole: 2.1592
quadrupole: -85.2067 -85.3371 -88.1391
quadrupole: -1.3657 8.4451 0.5709
quadrupole: 1.0210 0.8905 -1.9115 -1.3657 8.4451 0.5709
hfenergy: -618.9252297 hartree
pointgroup: C01 [X(C12H20O2)]
dipole: 0.473516 -0.0252782 0.704824 debye
polarizability: 139.2558583|-4.5762383|124.9685946|1.283403|0.7834181|121.4951518 unknown
InChI: InChI=1S/C12H20O2/c1-9(13)14-10-11(2)5-4-6-12(10,3)8-7-11/h10H,4-8H2,1-3H3
charge 0 multiplicity 1
34 atoms
O  -1.155545 0.603407 0.39932
O  -2.642729 0.657669 -1.410756
C  0.297832 -1.414923 -0.076385
C  1.262842 0.825346 -0.247978
C  -0.066845 0.049869 -0.449569
C  1.617422 -1.570584 -0.905271
C  2.237715 -0.130166 -1.016501
C  0.590276 -1.489297 1.451511
C  1.604891 0.860397 1.271893
C  1.752014 -0.55767 1.877725
C  -0.791467 -2.426671 -0.473165
C  1.220531 2.248501 -0.83129
C  -2.395356 0.86145 -0.201206
C  -3.363999 1.407091 0.827861
H  -0.401225 0.108125 -1.504414
H  1.383298 -1.969769 -1.909742
H  2.304185 -2.289423 -0.422681
H  3.257706 -0.076099 -0.595145
H  2.307672 0.1794 -2.076006
H  0.826128 -2.537421 1.723373
H  -0.331982 -1.209409 1.996769
H  0.800137 1.410564 1.796664
H  2.542389 1.432894 1.417793
H  1.800208 -0.493889 2.981952
H  2.714304 -0.998166 1.550583
H  -1.056274 -2.334173 -1.542755
H  -0.451196 -3.463731 -0.292035
H  -1.714573 -2.270077 0.11653
H  0.487841 2.87647 -0.290226
H  2.208619 2.739653 -0.750096
H  0.934278 2.235961 -1.900036
H  -2.913988 2.258539 1.365577
H  -3.593573 0.628904 1.577272
H  -4.293538 1.721529 0.332036
