program: Gaussian 09
title: 000173415
version: EM64L-G09RevD.01
frameworkgroup: C1[X(C9H6F6)]
method: RPBEPBE
basis: SDD
operation: Freq
keyword: #p
keyword: freq=noraman
keyword: PBEPBE/SDD
title: #p freq=noraman PBEPBE/SDD
converged: NO YES NO NO
title: Mulliken charges:
elementType: F F F F F F C C C C C C C C C H H H H H H
charge: -0.162653 -0.159600 -0.159820 -0.162656 -0.159757 -0.159661 0.336616 0.336615 0.497714 -0.423286 -0.526313 -0.526336 0.253003 0.253002 -0.799050 0.290380 0.276348 0.276351 0.248477 0.235315 0.235313
chargesum: 0.00000
title: Mulliken charges with hydrogens summed into heavy atoms:
elementType: F F F F F F C C C C C C C C C
charge: -0.162653 -0.159600 -0.159820 -0.162656 -0.159757 -0.159661 0.336616 0.336615 0.497714 -0.132906 -0.249965 -0.249985 0.253003 0.253002 -0.079945
polarizability: 1.14871574e+02 -4.09871874e-04 1.18130048e+02 -1.61690896e-03 3.93748067e-01 5.81226712e+01
1716.lowfreq: -23.8950 -22.6901 -8.4216 -0.0009 -0.0009 -0.0007 4.2205 5.6908 42.7152
frequency: -23.3577 -22.6319 42.5979 88.8801 109.0429 142.2574 179.7700 202.8632 261.9824 273.3866 293.4493 309.2968 336.0683 369.5593 411.9955 437.8868 459.2317 486.7989 534.7544 556.5857 568.6752 608.1078 633.3393 634.4229 699.7589 789.0322 878.3603 898.1021 909.2441 945.8234 988.6283 989.9106 994.6639 997.8785 1021.5339 1037.1523 1053.9461 1074.5329 1104.9893 1204.4761 1229.9780 1301.8808 1351.4658 1389.3801 1403.4201 1442.6784 1454.3609 1474.5057 1482.8791 1617.8125 1622.7192 2983.2701 3066.8103 3095.3992 3157.3859 3159.3143 3162.9113
redmass: 10.6741 18.9632 1.0116 8.0515 14.4440 7.5093 5.0268 3.0153 6.5052 15.3372 5.5535 9.0494 11.5687 6.3084 6.1251 11.5719 8.3399 11.1106 6.0720 6.8276 4.2962 13.5846 8.2228 15.5657 2.2266 11.2620 6.8682 1.6376 1.3708 1.4641 6.2554 1.8422 7.5959 10.2899 8.3187 3.9770 1.5755 5.3298 2.3281 1.6395 2.5468 1.2183 9.3037 6.4270 1.2289 2.1677 3.7038 1.0573 1.3514 5.7968 6.3042 1.0389 1.0953 1.1003 1.0918 1.0927 1.0942
irintensity: 0.0920 0.0000 0.8510 0.6334 2.0487 0.0086 0.0810 2.3946 5.5353 1.7769 0.0234 0.0036 7.0376 5.4606 0.6120 0.0027 3.4205 0.4364 0.4036 1.4824 1.3959 30.3630 0.0001 5.5409 18.3734 54.6213 71.8297 106.4626 0.4719 0.0265 0.8182 7.5741 0.0036 420.9060 117.0213 29.3077 16.5927 198.8389 123.9469 11.5034 479.0332 1.7016 108.1967 0.1238 22.0193 15.8481 15.0439 15.2930 4.2068 13.1969 5.2574 15.2769 14.5726 12.2360 0.0265 0.5061 1.8826
temp: 298.150 k
press: 1.00000 atm
elementType: 9 9 9 9 9 9 6 6 6 6 6 6 6 6 6 1 1 1 1 1 1
symmnumber: 1
zpe: 346469.4 jmol-1
zpe.correction: 0.131963 hartree
zpe.thermalcorrener: 0.144270 hartree
zpe.thermalcorrenthalpy: 0.145214 hartree
zpe.thermalcorrgfe: 0.092670 hartree
zpe.sumelectzpe: -944.528886 hartree
zpe.sumelectthermal: -944.516580 hartree
zpe.sumelectthermalent: -944.515635 hartree
zpe.sumelectthermalfe: -944.568180 hartree
dipole: -0.0001 4.6359 0.0610
dipole: 4.6363
quadrupole: -98.1360 -75.1931 -87.7213
quadrupole: -0.0002 0.0047 0.1993
quadrupole: -11.1192 11.8237 -0.7045 -0.0002 0.0047 0.1993
hfenergy: -944.6608493 hartree
pointgroup: C01 [X(C9H6F6)]
dipole: 0.000005 1.8239146 0.0216011 debye
dipolederiv: -0.7712831 0.1768287 -0.0026498 0.1296223 -0.4686194 0.0013668 -0.0020173 0.0016393 -0.2841497 -0.4571054 -0.159053 -0.0623347 -0.2088964 -0.5514508 -0.271767 -0.082186 -0.2510154 -0.6226962 -0.4574634 -0.1594492 0.0653507 -0.2081772 -0.5438651 0.2693975 0.0854991 0.2487261 -0.6300607 -0.771276 -0.1768277 0.003075 -0.1296183 -0.4686247 0.0012342 0.0026549 0.0016229 -0.2841531 -0.4575107 0.159795 -0.065338 0.2086059 -0.5444188 0.2692393 -0.0853512 0.2485085 -0.6293005 -0.4570614 0.1587073 0.0623542 0.2084725 -0.550898 -0.2719435 0.0823427 -0.25125 -0.6234548 -0.2803877 -0.1058219 0.0039239 -0.1305572 -0.128219 0.0009242 0.0024748 -0.0051127 -0.140462 -0.2804062 0.1058164 -0.0037443 0.1305549 -0.1282124 0.0006825 -0.0025224 -0.0051776 -0.1404498 -0.1904251 0.000056 0.0001851 0.0000123 0.524495 0.0196879 0.0001787 0.0731929 -0.0077663 -0.0121713 -0.0000044 -0.000047 -0.0000032 -0.0525568 -0.004547 -0.0000505 0.0000838 -0.0742257 0.057237 -0.1541649 -0.006551 0.1045551 -0.1122559 0.0001975 -0.0095414 -0.0077634 -0.1071303 0.0572663 0.1541524 0.0063025 -0.1045536 -0.1122585 0.0004354 0.0094915 -0.0080555 -0.1071592 1.870774 0.2906121 -0.00116 0.3930408 1.5308896 0.0017695 -0.0028923 0.0029022 1.5398174 1.8707751 -0.2906112 0.0003836 -0.3930495 1.5308982 0.0024422 0.0017162 0.0036214 1.5398148 0.0535417 -0.000072 -0.0000117 -0.0000016 -0.1861222 -0.0174402 -0.000036 -0.1206403 0.0440114 0.1206061 0.0000004 0.0000377 0.0000007 0.0308718 0.0008526 0.0000492 0.001161 0.1576328 0.0386391 0.0625752 0.0011124 0.0688163 0.07548 0.0033061 -0.0029151 0.0054367 0.1507243 0.0386412 -0.0625663 -0.0009243 -0.0688095 0.0754803 0.0034265 0.003067 0.0055185 0.1507232 0.1236496 -0.0000738 -0.0001618 -0.0000442 0.0020844 -0.0427921 -0.0001653 -0.0791037 -0.0757323 -0.0478776 -0.0850403 0.0944409 -0.0150566 0.0386508 0.016776 0.0721235 0.0679241 0.0718683 -0.0481622 0.0851412 -0.0942434 0.0150867 0.0386512 0.0167516 -0.07192 0.067781 0.0721484 unknown
polarizability: 114.8715108|-0.0000645|118.1309772|-0.0597427|0.3151082|58.1218051 unknown
InChI: InChI=1S/C9H6F6/c1-5-2-6(8(10,11)12)4-7(3-5)9(13,14)15/h2-4H,1H3
charge 0 multiplicity 1
21 atoms
F  -3.64416 0.05027 -0.005821
F  -2.624767 -1.643393 -1.121611
F  -2.630009 -1.62608 1.140161
F  3.644188 0.050248 -0.011617
F  2.631294 -1.627342 1.133949
F  2.623559 -1.642199 -1.127831
C  -1.211823 -0.013194 0.000489
C  1.211862 -0.013209 -0.001786
C  0.000019 2.123965 -0.014189
C  0.000021 -0.735935 0.005416
C  -1.216456 1.398552 -0.011206
C  1.216486 1.398541 -0.013493
C  -2.504655 -0.78459 0.00294
C  2.504688 -0.784618 -0.002049
C  0.000027 3.640268 0.003301
H  0.000019 -1.830625 0.011005
H  -2.170666 1.935355 -0.018281
H  2.170691 1.935331 -0.022122
H  0.000883 4.020901 1.042766
H  0.893473 4.050595 -0.497909
H  -0.894275 4.050561 -0.496412
